program: Orca
programVersion: 5.0.2
elementType: O O O N C C C C C C C C C C C C C C C C C C C C C C H H H H H H H H H H H H H H H H H H H H H H H
charge: 0
multiplicity: 1
keywords: wb97x-d3
keywords: def2-TZVPP
keywords: def2/J RIJCOSX
keywords: DEFGRID2
keywords: scfconv7
keywords: smallprint printgap noloewdin
keywords: NOSOSCF
formula: C22H23NO3
InChI: InChI=1/C22H23NO3/c1-21(2)19(22(21,3)4)20(24)26-18(14-23)15-9-8-12-17(13-15)25-16-10-6-5-7-11-16/h5-13,18-19H,1-4H3
49 atoms
O  0.80915 2.503997 1.022264
O  0.938405 2.134966 -1.176725
O  -2.346673 -2.113331 -0.690178
N  -1.715826 3.095926 3.07467
C  4.045108 2.207387 -0.678454
C  3.696365 3.63217 -0.974612
C  2.877925 2.862291 0.055919
C  3.80214 1.126453 -1.707678
C  5.253976 1.881124 0.172753
C  4.554635 4.753497 -0.428069
C  3.096461 4.017364 -2.307963
C  1.476991 2.461438 -0.154631
C  -0.530716 2.044851 0.996002
C  -0.609267 0.536792 1.046224
C  -1.178593 2.639993 2.167756
C  -1.444467 -0.133758 0.169818
C  0.142241 -0.168001 1.978993
C  -1.534102 -1.518856 0.222834
C  0.057124 -1.549009 2.01172
C  -0.774187 -2.234605 1.138538
C  -2.976936 -3.286097 -0.378472
C  -2.931737 -4.308438 -1.313369
C  -3.689021 -3.439707 0.804689
C  -3.610574 -5.491676 -1.063601
C  -4.353288 -4.631509 1.046374
C  -4.317968 -5.661048 0.116581
H  3.08648 3.125734 1.087026
H  4.673527 1.047608 -2.360549
H  3.673606 0.160731 -1.21602
H  2.93037 1.286493 -2.332282
H  5.152121 0.882857 0.601331
H  6.162379 1.887813 -0.432755
H  5.403399 2.57155 1.000237
H  4.941237 4.56205 0.570802
H  5.408268 4.934526 -1.084039
H  3.97729 5.678059 -0.3781
H  3.898427 4.223036 -3.019558
H  2.447009 3.267006 -2.744776
H  2.510155 4.932068 -2.204946
H  -1.051174 2.410513 0.104635
H  -2.025111 0.406669 -0.567453
H  0.789691 0.353238 2.67177
H  0.646793 -2.106903 2.726784
H  -0.825358 -3.314846 1.172668
H  -2.374532 -4.168887 -2.230282
H  -3.729717 -2.635481 1.528315
H  -3.578658 -6.287573 -1.795828
H  -4.909406 -4.750874 1.966795
H  -4.842326 -6.586979 0.309794
totalener: -1132.67500734 hartree
nucrepener: 2185.13286303 hartree
electener: -3317.80787038 hartree
oneelecener: -5878.84514450 hartree
twoeener: 2561.03727413 hartree
kineticenergy: 1127.72819979 hartree
xcener: -110.666948599372 hartree
chargesum: -0.0000000
charge: -0.274201 -0.383976 -0.296318 -0.003368 0.080975 0.084390 -0.114624 -0.273518 -0.257304 -0.254452 -0.274934 0.326978 0.314234 0.050153 -0.251351 -0.167638 -0.189934 0.198540 -0.112650 -0.145828 0.224471 -0.197787 -0.155802 -0.097534 -0.117558 -0.137443 0.076480 0.089313 0.088580 0.105488 0.089537 0.093113 0.078448 0.077889 0.092313 0.091480 0.087836 0.105515 0.087865 0.117631 0.109212 0.125122 0.129172 0.134893 0.127155 0.136827 0.126379 0.129125 0.127103
qa: -0.2742 -0.3840 -0.2963 -0.0034 0.0810 0.0844 -0.1146 -0.2735 -0.2573 -0.2545 -0.2749 0.3270 0.3142 0.0502 -0.2514 -0.1676 -0.1899 0.1985 -0.1127 -0.1458 0.2245 -0.1978 -0.1558 -0.0975 -0.1176 -0.1374 0.0765 0.0893 0.0886 0.1055 0.0895 0.0931 0.0784 0.0779 0.0923 0.0915 0.0878 0.1055 0.0879 0.1176 0.1092 0.1251 0.1292 0.1349 0.1272 0.1368 0.1264 0.1291 0.1271
va: 2.1178 2.1116 2.1085 3.1236 3.7320 3.7352 3.9315 3.9226 3.9069 3.9049 3.9206 4.1788 3.8417 3.6669 4.0193 4.0780 4.0255 3.9118 3.9577 3.9338 3.8174 4.0346 3.9490 3.9356 3.9463 3.9558 1.0331 0.9989 1.0035 1.0172 1.0063 1.0011 1.0099 1.0101 1.0011 1.0059 0.9993 1.0174 1.0032 1.0243 1.0259 1.0192 1.0009 1.0034 1.0130 1.0022 0.9990 0.9997 1.0000
dispcorr: -0.023319849 hartree
energy: -1132.698327192677
dipole: 29.62473 -28.42412 1.20061 8.43875 -9.42969 -0.99094 -9.79990 9.26758 -0.53232
magnitude: 1.64523 au
magnitude: 4.18183 debye
