program: Orca
programVersion: 5.0.2
elementType: O O O N C C C C C C C C C C C C C C C C C C C C C C H H H H H H H H H H H H H H H H H H H H H H H
charge: 0
multiplicity: 1
keywords: wb97x-d3
keywords: def2-TZVPP
keywords: def2/J RIJCOSX
keywords: DEFGRID2
keywords: scfconv7
keywords: smallprint printgap noloewdin
keywords: NOSOSCF
formula: C22H23NO3
InChI: InChI=1/C22H23NO3/c1-21(2)19(22(21,3)4)20(24)26-18(14-23)15-9-8-12-17(13-15)25-16-10-6-5-7-11-16/h5-13,18-19H,1-4H3
49 atoms
O  0.077216 1.977863 0.750988
O  0.747401 2.2497 -1.364003
O  -2.246985 -2.285556 -0.693585
N  -2.306458 3.417743 2.546469
C  2.835656 0.033283 -0.379026
C  3.57602 1.33504 -0.409185
C  2.222595 1.273743 0.276016
C  2.228459 -0.532949 -1.642584
C  3.254195 -1.071137 0.566701
C  4.762103 1.544752 0.509301
C  3.769854 2.08415 -1.708952
C  0.991599 1.886122 -0.247895
C  -1.206493 2.432495 0.389893
C  -2.089609 1.340449 -0.18488
C  -1.80491 2.973916 1.613458
C  -1.710783 0.007455 -0.123102
C  -3.295629 1.706776 -0.763016
C  -2.552746 -0.962303 -0.655782
C  -4.130132 0.728316 -1.278325
C  -3.767551 -0.605236 -1.227409
C  -1.234887 -2.804411 0.062819
C  -1.245625 -2.718067 1.449186
C  -0.222834 -3.487574 -0.59466
C  -0.229542 -3.321822 2.173351
C  0.780558 -4.099687 0.142059
C  0.784167 -4.015298 1.526284
H  2.253891 1.261542 1.360238
H  1.407952 -1.208738 -1.393685
H  1.838427 0.212314 -2.328629
H  2.979291 -1.117188 -2.178613
H  3.618859 -0.70789 1.525259
H  2.410342 -1.732178 0.770003
H  4.045697 -1.676431 0.119554
H  4.955088 2.611418 0.634395
H  4.623643 1.126738 1.50447
H  5.661284 1.095395 0.083297
H  4.68924 1.740306 -2.186842
H  2.960822 1.97409 -2.421432
H  3.883515 3.15167 -1.513997
H  -1.137472 3.249607 -0.337367
H  -0.770899 -0.276724 0.330423
H  -3.587532 2.748684 -0.809257
H  -5.073315 1.007464 -1.728088
H  -4.410821 -1.373559 -1.635044
H  -2.043253 -2.191556 1.957784
H  -0.234655 -3.547926 -1.675221
H  -0.237336 -3.255554 3.253162
H  1.565497 -4.638465 -0.372078
H  1.569219 -4.490406 2.098902
totalener: -1132.67382240 hartree
nucrepener: 2334.14234556 hartree
electener: -3466.81616796 hartree
oneelecener: -6176.58186690 hartree
twoeener: 2709.76569894 hartree
kineticenergy: 1127.72019031 hartree
xcener: -110.670031525641 hartree
chargesum: -0.0000000
charge: -0.280348 -0.368553 -0.292554 -0.001771 0.099022 0.102842 -0.126910 -0.269378 -0.237534 -0.261315 -0.271473 0.293340 0.304757 0.067119 -0.256636 -0.208901 -0.218624 0.306663 -0.066743 -0.228447 0.281930 -0.190533 -0.248541 -0.084365 -0.096109 -0.149847 0.078437 0.067616 0.108799 0.095335 0.079470 0.063770 0.092157 0.091776 0.077734 0.093147 0.086162 0.102702 0.088561 0.130359 0.117076 0.113117 0.127139 0.126595 0.137052 0.135362 0.132332 0.128104 0.130107
qa: -0.2803 -0.3686 -0.2926 -0.0018 0.0990 0.1028 -0.1269 -0.2694 -0.2375 -0.2613 -0.2715 0.2933 0.3048 0.0671 -0.2566 -0.2089 -0.2186 0.3067 -0.0667 -0.2284 0.2819 -0.1905 -0.2485 -0.0844 -0.0961 -0.1498 0.0784 0.0676 0.1088 0.0953 0.0795 0.0638 0.0922 0.0918 0.0777 0.0931 0.0862 0.1027 0.0886 0.1304 0.1171 0.1131 0.1271 0.1266 0.1371 0.1354 0.1323 0.1281 0.1301
va: 2.0941 2.1210 2.1279 3.1275 3.7285 3.7490 3.9322 3.9055 3.9055 3.9060 3.9133 4.1977 3.8132 3.7386 4.0004 3.9714 4.0700 3.7637 3.9414 4.0448 3.7405 3.9802 3.9893 3.8978 3.8505 3.9071 1.0349 1.0196 1.0202 1.0009 1.0153 1.0170 1.0019 1.0058 1.0100 1.0008 0.9988 1.0184 1.0039 1.0217 1.0207 1.0116 0.9989 1.0142 1.0034 1.0108 0.9977 0.9999 1.0002
dispcorr: -0.027712127 hartree
energy: -1132.701534525602
dipole: 29.22072 -28.10166 1.11906 -5.46334 4.30144 -1.16190 -4.87195 4.32543 -0.54652
magnitude: 1.70323 au
magnitude: 4.32926 debye
