program: Orca
programVersion: 5.0.2
elementType: O O O N C C C C C C C C C C C C C C C C C C C C C C H H H H H H H H H H H H H H H H H H H H H H H
charge: 0
multiplicity: 1
keywords: wb97x-d3
keywords: def2-TZVPP
keywords: def2/J RIJCOSX
keywords: DEFGRID2
keywords: scfconv7
keywords: smallprint printgap noloewdin
keywords: NOSOSCF
formula: C22H23NO3
InChI: InChI=1/C22H23NO3/c1-21(2)19(22(21,3)4)20(24)26-18(14-23)15-9-8-12-17(13-15)25-16-10-6-5-7-11-16/h5-13,18-19H,1-4H3
49 atoms
O  0.608058 2.014191 0.472364
O  1.009293 2.712583 -1.614887
O  -2.535705 -2.253021 1.344062
N  -1.801086 3.023814 2.497461
C  3.967092 1.848387 -1.097025
C  3.908573 3.200631 -0.457672
C  2.829388 2.167571 -0.1363
C  3.715877 1.684692 -2.57922
C  4.970814 0.825344 -0.607594
C  4.844436 3.547363 0.680361
C  3.578561 4.425908 -1.27934
C  1.426882 2.336025 -0.552201
C  -0.792992 2.139729 0.25471
C  -1.394199 0.822285 -0.169755
C  -1.351215 2.628689 1.517463
C  -1.69344 -0.15213 0.771326
C  -1.592653 0.572734 -1.52188
C  -2.208552 -1.373592 0.361384
C  -2.104276 -0.651968 -1.919552
C  -2.419753 -1.62878 -0.989005
C  -2.511713 -3.59833 1.105317
C  -3.612657 -4.341436 1.502263
C  -1.404249 -4.219976 0.542298
C  -3.601559 -5.718664 1.33937
C  -1.410879 -5.595737 0.375318
C  -2.506169 -6.350486 0.771001
H  2.92081 1.717027 0.845786
H  3.342451 0.680827 -2.788554
H  3.002316 2.385539 -2.997186
H  4.657579 1.801329 -3.119283
H  4.65215 -0.178801 -0.891576
H  5.947794 1.000768 -1.061972
H  5.10418 0.82567 0.472194
H  5.028985 2.718865 1.360839
H  5.809909 3.880068 0.294186
H  4.428818 4.363458 1.273264
H  2.87685 4.251393 -2.087873
H  3.152413 5.202855 -0.642048
H  4.495155 4.828969 -1.714465
H  -0.993676 2.895427 -0.51027
H  -1.550067 0.028805 1.829905
H  -1.344625 1.326527 -2.256649
H  -2.271548 -0.848713 -2.969968
H  -2.834948 -2.573723 -1.313934
H  -4.464253 -3.840061 1.94297
H  -0.542595 -3.636601 0.243472
H  -4.459318 -6.297952 1.654388
H  -0.547732 -6.080657 -0.06106
H  -2.502391 -7.424257 0.642417
totalener: -1132.67586711 hartree
nucrepener: 2181.11360095 hartree
electener: -3313.78946806 hartree
oneelecener: -5870.76617792 hartree
twoeener: 2556.97670986 hartree
kineticenergy: 1127.72255966 hartree
xcener: -110.666464185669 hartree
chargesum: -0.0000000
charge: -0.263160 -0.404897 -0.292487 -0.006313 0.086268 0.078105 -0.127125 -0.271764 -0.255772 -0.254967 -0.278788 0.366924 0.328662 -0.003917 -0.257534 -0.193031 -0.133629 0.202442 -0.121123 -0.152593 0.232524 -0.197873 -0.165191 -0.096202 -0.113734 -0.138958 0.075756 0.087111 0.103945 0.087244 0.089215 0.092713 0.078170 0.077415 0.092724 0.092474 0.104004 0.090146 0.090344 0.117472 0.121549 0.126130 0.129744 0.134622 0.127636 0.134071 0.127485 0.127115 0.127047
qa: -0.2632 -0.4049 -0.2925 -0.0063 0.0863 0.0781 -0.1271 -0.2718 -0.2558 -0.2550 -0.2788 0.3669 0.3287 -0.0039 -0.2575 -0.1930 -0.1336 0.2024 -0.1211 -0.1526 0.2325 -0.1979 -0.1652 -0.0962 -0.1137 -0.1390 0.0758 0.0871 0.1039 0.0872 0.0892 0.0927 0.0782 0.0774 0.0927 0.0925 0.1040 0.0901 0.0903 0.1175 0.1215 0.1261 0.1297 0.1346 0.1276 0.1341 0.1275 0.1271 0.1270
va: 2.1262 2.0860 2.1136 3.1168 3.7183 3.7382 3.9362 3.9185 3.9081 3.9076 3.9237 4.1467 3.8049 3.7409 4.0265 4.1073 3.9659 3.9091 3.9728 3.9376 3.8112 4.0386 3.9562 3.9349 3.9423 3.9574 1.0339 1.0034 1.0175 0.9992 1.0060 1.0010 1.0102 1.0103 1.0007 1.0059 1.0164 1.0029 0.9995 1.0256 1.0301 1.0211 1.0012 1.0037 1.0130 1.0027 0.9988 0.9999 1.0000
dispcorr: -0.023032094 hartree
energy: -1132.698899208998
dipole: 31.66998 -30.59420 1.07578 6.66090 -7.81277 -1.15187 -11.17805 10.05539 -1.12267
magnitude: 1.93507 au
magnitude: 4.91855 debye
