program: Orca
programVersion: 5.0.2
elementType: O O O N C C C C C C C C C C C C C C C C C C C C C C H H H H H H H H H H H H H H H H H H H H H H H
charge: 0
multiplicity: 1
keywords: wb97x-d3
keywords: def2-TZVPP
keywords: def2/J RIJCOSX
keywords: DEFGRID2
keywords: scfconv7
keywords: smallprint printgap noloewdin
keywords: NOSOSCF
formula: C22H23NO3
InChI: InChI=1/C22H23NO3/c1-21(2)19(22(21,3)4)20(24)26-18(14-23)15-9-8-12-17(13-15)25-16-10-6-5-7-11-16/h5-13,18-19H,1-4H3
49 atoms
O  0.596175 2.03166 0.483162
O  0.998865 2.68623 -1.617705
O  -2.472593 -2.250613 1.378045
N  -1.818025 3.066183 2.493531
C  3.95359 1.819731 -1.095631
C  3.90132 3.173655 -0.459393
C  2.81736 2.146016 -0.135827
C  3.705013 1.655716 -2.578296
C  4.952378 0.793115 -0.603591
C  4.83801 3.520412 0.677795
C  3.576268 4.39721 -1.285609
C  1.41538 2.32284 -0.549985
C  -0.803535 2.162059 0.261866
C  -1.408903 0.843925 -0.153605
C  -1.363843 2.661826 1.519429
C  -1.672552 -0.13691 0.791734
C  -1.643813 0.598993 -1.500578
C  -2.187207 -1.361425 0.39114
C  -2.156785 -0.628234 -1.888867
C  -2.435369 -1.612203 -0.954111
C  -2.461121 -3.592138 1.115768
C  -3.571145 -4.334206 1.487957
C  -1.354676 -4.209936 0.546808
C  -3.570964 -5.707514 1.292622
C  -1.371508 -5.581254 0.347772
C  -2.476836 -6.335106 0.717202
H  2.907483 1.698021 0.847627
H  2.988387 2.353157 -2.996613
H  4.647101 1.777664 -3.11663
H  3.337028 0.650161 -2.789159
H  4.62847 -0.210263 -0.884392
H  5.929877 0.962207 -1.059251
H  5.086661 0.795897 0.476097
H  5.025572 2.690959 1.356292
H  5.802158 3.856135 0.29089
H  4.421284 4.334365 1.272924
H  2.868576 4.223738 -2.089209
H  3.159909 5.180907 -0.650109
H  4.493338 4.790727 -1.728359
H  -1.000073 2.91303 -0.50893
H  -1.499832 0.041185 1.846507
H  -1.42146 1.357593 -2.238716
H  -2.352276 -0.821929 -2.935014
H  -2.850142 -2.559663 -1.27204
H  -4.421597 -3.835472 1.933879
H  -0.486493 -3.62631 0.267718
H  -4.4363 -6.286432 1.58712
H  -0.509394 -6.063816 -0.09329
H  -2.48185 -7.405415 0.562186
totalener: -1132.67583637 hartree
nucrepener: 2183.05319603 hartree
electener: -3315.72903240 hartree
oneelecener: -5874.65400107 hartree
twoeener: 2558.92496867 hartree
kineticenergy: 1127.72302213 hartree
xcener: -110.666373995029 hartree
chargesum: -0.0000000
charge: -0.263417 -0.404594 -0.292576 -0.005911 0.087259 0.078764 -0.129495 -0.271652 -0.255729 -0.254781 -0.279696 0.367412 0.329047 -0.003860 -0.258389 -0.191440 -0.130779 0.197836 -0.122788 -0.147824 0.221994 -0.191181 -0.158264 -0.099579 -0.115618 -0.135726 0.075641 0.103993 0.087260 0.086848 0.089176 0.092626 0.078096 0.077359 0.092580 0.092669 0.104000 0.090164 0.090718 0.116726 0.121164 0.124688 0.129373 0.134245 0.127799 0.133926 0.127630 0.127089 0.127219
qa: -0.2634 -0.4046 -0.2926 -0.0059 0.0873 0.0788 -0.1295 -0.2717 -0.2557 -0.2548 -0.2797 0.3674 0.3290 -0.0039 -0.2584 -0.1914 -0.1308 0.1978 -0.1228 -0.1478 0.2220 -0.1912 -0.1583 -0.0996 -0.1156 -0.1357 0.0756 0.1040 0.0873 0.0868 0.0892 0.0926 0.0781 0.0774 0.0926 0.0927 0.1040 0.0902 0.0907 0.1167 0.1212 0.1247 0.1294 0.1342 0.1278 0.1339 0.1276 0.1271 0.1272
va: 2.1276 2.0864 2.1119 3.1174 3.7168 3.7392 3.9386 3.9180 3.9081 3.9070 3.9245 4.1481 3.8074 3.7354 4.0269 4.1061 3.9657 3.9100 3.9757 3.9317 3.8208 4.0347 3.9577 3.9358 3.9427 3.9542 1.0339 1.0177 0.9991 1.0036 1.0060 1.0011 1.0102 1.0104 1.0008 1.0058 1.0163 1.0029 0.9995 1.0256 1.0297 1.0210 1.0013 1.0042 1.0126 1.0026 0.9988 1.0000 0.9999
dispcorr: -0.023066315 hartree
energy: -1132.698902681953
dipole: 31.54934 -30.48577 1.06356 6.42548 -7.60256 -1.17708 -11.29736 10.17278 -1.12458
magnitude: 1.94457 au
magnitude: 4.94272 debye
