program: Orca
programVersion: 5.0.2
elementType: O O O N C C C C C C C C C C C C C C C C C C C C C C H H H H H H H H H H H H H H H H H H H H H H H
charge: 0
multiplicity: 1
keywords: wb97x-d3
keywords: def2-TZVPP
keywords: def2/J RIJCOSX
keywords: DEFGRID2
keywords: scfconv7
keywords: smallprint printgap noloewdin
keywords: NOSOSCF
formula: C22H23NO3
InChI: InChI=1/C22H23NO3/c1-21(2)19(22(21,3)4)20(24)26-18(14-23)15-9-8-12-17(13-15)25-16-10-6-5-7-11-16/h5-13,18-19H,1-4H3
49 atoms
O  0.681792 2.078063 0.521746
O  0.940879 2.941182 -1.526516
O  -2.408624 -2.264748 1.475655
N  -1.649383 2.955878 2.697806
C  3.882216 1.884079 -1.281894
C  3.95032 3.248451 -0.671363
C  2.855717 2.283391 -0.225713
C  3.479931 1.708745 -2.728852
C  4.869355 0.814815 -0.86521
C  5.004559 3.564508 0.368116
C  3.617971 4.475192 -1.490658
C  1.429216 2.486744 -0.525869
C  -0.733882 2.151857 0.386413
C  -1.293411 0.81496 -0.036747
C  -1.242107 2.594458 1.686362
C  -1.60747 -0.154247 0.902386
C  -1.431614 0.544345 -1.394388
C  -2.07459 -1.395662 0.488108
C  -1.889615 -0.699101 -1.794767
C  -2.217029 -1.675261 -0.865404
C  -2.527221 -3.601233 1.208465
C  -1.427264 -4.34773 0.806967
C  -3.757974 -4.204742 1.409631
C  -1.569191 -5.711956 0.609794
C  -3.885292 -5.572915 1.217194
C  -2.79537 -6.329552 0.814902
H  3.016806 1.839532 0.750387
H  2.747492 2.425468 -3.083055
H  4.36518 1.793141 -3.362438
H  3.060503 0.713192 -2.884723
H  5.803784 0.919843 -1.420174
H  5.111829 0.83308 0.195309
H  4.465401 -0.174641 -1.085438
H  5.940717 3.855846 -0.112301
H  4.680453 4.400953 0.989478
H  5.222017 2.734573 1.037276
H  3.297581 5.288123 -0.836769
H  4.513897 4.813809 -2.01481
H  2.836239 4.328366 -2.227727
H  -1.006192 2.912084 -0.351548
H  -1.512852 0.041867 1.963691
H  -1.179822 1.297285 -2.128936
H  -2.006369 -0.913919 -2.848589
H  -2.589898 -2.634993 -1.197633
H  -0.468664 -3.866515 0.66022
H  -4.602236 -3.606189 1.725471
H  -0.7125 -6.296976 0.302554
H  -4.843895 -6.046731 1.381841
H  -2.898565 -7.395964 0.666974
totalener: -1132.67592524 hartree
nucrepener: 2179.89721961 hartree
electener: -3312.57314485 hartree
oneelecener: -5868.35134909 hartree
twoeener: 2555.77820424 hartree
kineticenergy: 1127.71817667 hartree
xcener: -110.665568901782 hartree
chargesum: -0.0000000
charge: -0.262427 -0.405361 -0.289563 -0.007265 0.085055 0.083301 -0.130742 -0.275576 -0.254782 -0.255746 -0.275803 0.368222 0.323651 -0.003607 -0.254675 -0.195610 -0.145143 0.211500 -0.129242 -0.151243 0.204957 -0.152890 -0.173684 -0.119172 -0.108605 -0.126787 0.076326 0.103788 0.089370 0.086492 0.091860 0.078151 0.089665 0.092023 0.092743 0.077412 0.088768 0.089107 0.104676 0.121131 0.121229 0.131584 0.129415 0.131405 0.133051 0.128833 0.128512 0.127930 0.127763
qa: -0.2624 -0.4054 -0.2896 -0.0073 0.0851 0.0833 -0.1307 -0.2756 -0.2548 -0.2557 -0.2758 0.3682 0.3237 -0.0036 -0.2547 -0.1956 -0.1451 0.2115 -0.1292 -0.1512 0.2050 -0.1529 -0.1737 -0.1192 -0.1086 -0.1268 0.0763 0.1038 0.0894 0.0865 0.0919 0.0782 0.0897 0.0920 0.0927 0.0774 0.0888 0.0891 0.1047 0.1211 0.1212 0.1316 0.1294 0.1314 0.1331 0.1288 0.1285 0.1279 0.1278
va: 2.1238 2.0848 2.1133 3.1158 3.7228 3.7249 3.9436 3.9222 3.9061 3.9073 3.9205 4.1423 3.8032 3.7725 4.0251 4.1043 3.9587 3.9102 3.9847 3.9303 3.8360 3.9747 4.0281 3.9414 3.9379 3.9460 1.0341 1.0171 0.9995 1.0035 1.0010 1.0106 1.0058 1.0010 1.0056 1.0103 1.0033 0.9993 1.0170 1.0258 1.0325 1.0196 1.0015 1.0072 1.0031 1.0112 0.9996 0.9992 0.9998
dispcorr: -0.023097220 hartree
energy: -1132.699022459399
dipole: 30.82572 -29.82782 0.99790 6.41979 -7.70537 -1.28558 -13.46626 12.24989 -1.21637
magnitude: 2.03176 au
magnitude: 5.16434 debye
