program: Orca
programVersion: 5.0.2
elementType: O O O N C C C C C C C C C C C C C C C C C C C C C C H H H H H H H H H H H H H H H H H H H H H H H
charge: 0
multiplicity: 1
keywords: wb97x-d3
keywords: def2-TZVPP
keywords: def2/J RIJCOSX
keywords: DEFGRID2
keywords: scfconv7
keywords: smallprint printgap noloewdin
keywords: NOSOSCF
formula: C22H23NO3
InChI: InChI=1/C22H23NO3/c1-21(2)19(22(21,3)4)20(24)26-18(14-23)15-9-8-12-17(13-15)25-16-10-6-5-7-11-16/h5-13,18-19H,1-4H3
49 atoms
O  0.266112 2.452234 0.066986
O  1.438262 1.609751 -1.644189
O  -1.045522 -2.673687 -0.502978
N  -2.498214 4.22795 -0.300208
C  3.794788 1.592835 0.433688
C  3.91887 2.915013 -0.255025
C  2.562884 2.485532 0.293388
C  3.902704 0.301885 -0.346012
C  4.32284 1.416868 1.84155
C  4.568793 4.081293 0.459415
C  4.170508 2.991044 -1.743949
C  1.418222 2.124724 -0.557453
C  -0.955013 2.140509 -0.595148
C  -1.552472 0.873846 -0.029314
C  -1.820634 3.308458 -0.419804
C  -1.096422 -0.33996 -0.526767
C  -2.497823 0.899224 0.987607
C  -1.576337 -1.529884 0.003015
C  -2.978322 -0.29555 1.499012
C  -2.52435 -1.513655 1.019758
C  -1.74683 -3.844857 -0.399108
C  -2.965862 -4.000763 -1.045399
C  -1.189492 -4.887444 0.322939
C  -3.626129 -5.216149 -0.964108
C  -1.857044 -6.102128 0.39167
C  -3.075143 -6.270267 -0.248287
H  2.263868 2.986453 1.207388
H  3.530819 0.354611 -1.363417
H  4.948544 -0.008515 -0.388553
H  3.348475 -0.49035 0.160377
H  4.151143 2.278816 2.482798
H  3.842397 0.561152 2.318575
H  5.39732 1.223787 1.825836
H  4.327226 4.1336 1.519033
H  5.655524 4.028715 0.369633
H  4.246554 5.021972 0.010324
H  3.717556 2.191995 -2.319783
H  3.789233 3.932829 -2.142061
H  5.246224 2.971405 -1.929197
H  -0.782252 2.017079 -1.668437
H  -0.363007 -0.371798 -1.322767
H  -2.867473 1.839062 1.376093
H  -3.715814 -0.2812 2.290208
H  -2.905215 -2.436323 1.437105
H  -3.388354 -3.18082 -1.612204
H  -0.237787 -4.747197 0.818321
H  -4.573398 -5.341824 -1.471506
H  -1.420953 -6.918808 0.951517
H  -3.593123 -7.218074 -0.192778
totalener: -1132.67590459 hartree
nucrepener: 2193.54056510 hartree
electener: -3326.21646969 hartree
oneelecener: -5895.65374792 hartree
twoeener: 2569.43727823 hartree
kineticenergy: 1127.72103098 hartree
xcener: -110.666245019304 hartree
chargesum: -0.0000000
charge: -0.260858 -0.403895 -0.294194 -0.007739 0.085093 0.085387 -0.130810 -0.278543 -0.255014 -0.256449 -0.272498 0.365947 0.321676 -0.011380 -0.251831 -0.157264 -0.168036 0.179429 -0.117290 -0.147102 0.195766 -0.137108 -0.173887 -0.124096 -0.111612 -0.123199 0.076870 0.104477 0.089463 0.089097 0.078146 0.089523 0.092693 0.077410 0.092030 0.092029 0.104874 0.087856 0.087494 0.122921 0.135648 0.122219 0.130100 0.131087 0.134524 0.126716 0.129174 0.127304 0.127855
qa: -0.2609 -0.4039 -0.2942 -0.0077 0.0851 0.0854 -0.1308 -0.2785 -0.2550 -0.2564 -0.2725 0.3659 0.3217 -0.0114 -0.2518 -0.1573 -0.1680 0.1794 -0.1173 -0.1471 0.1958 -0.1371 -0.1739 -0.1241 -0.1116 -0.1232 0.0769 0.1045 0.0895 0.0891 0.0781 0.0895 0.0927 0.0774 0.0920 0.0920 0.1049 0.0879 0.0875 0.1229 0.1356 0.1222 0.1301 0.1311 0.1345 0.1267 0.1292 0.1273 0.1279
va: 2.1200 2.0872 2.1061 3.1177 3.7274 3.7201 3.9430 3.9262 3.9051 3.9078 3.9184 4.1426 3.8015 3.8003 4.0188 3.9879 4.0280 3.9170 3.9827 3.9333 3.8481 3.9674 4.0219 3.9445 3.9403 3.9428 1.0339 1.0161 0.9995 1.0030 1.0107 1.0061 1.0007 1.0102 1.0010 1.0060 1.0175 1.0035 0.9991 1.0269 1.0314 1.0208 1.0016 1.0064 1.0026 1.0114 0.9997 0.9992 0.9996
dispcorr: -0.023242519 hartree
energy: -1132.699147107610
dipole: 28.92023 -28.16686 0.75337 3.82752 -5.25686 -1.42933 4.26111 -3.59782 0.66328
magnitude: 1.74657 au
magnitude: 4.43942 debye
