program: Orca
programVersion: 5.0.2
elementType: O O O N C C C C C C C C C C C C C C C C C C C C C C H H H H H H H H H H H H H H H H H H H H H H H
charge: 0
multiplicity: 1
keywords: wb97x-d3
keywords: def2-TZVPP
keywords: def2/J RIJCOSX
keywords: DEFGRID2
keywords: scfconv7
keywords: smallprint printgap noloewdin
keywords: NOSOSCF
formula: C22H23NO3
InChI: InChI=1/C22H23NO3/c1-21(2)19(22(21,3)4)20(24)26-18(14-23)15-9-8-12-17(13-15)25-16-10-6-5-7-11-16/h5-13,18-19H,1-4H3
49 atoms
O  0.804395 1.463192 -0.403502
O  1.099414 3.66477 -0.62516
O  -1.28917 -3.013556 0.769514
N  -0.993052 2.508304 2.262421
C  3.918255 2.8695 -1.771454
C  4.149579 2.995619 -0.298848
C  2.974564 2.162535 -0.803296
C  3.450704 4.056541 -2.583329
C  4.800936 1.963256 -2.602622
C  5.266886 2.218046 0.364112
C  3.918573 4.3132 0.405744
C  1.570874 2.560238 -0.611651
C  -0.577621 1.687838 -0.188985
C  -1.315338 0.397027 -0.433972
C  -0.797824 2.159971 1.185312
C  -0.993405 -0.740644 0.294592
C  -2.326607 0.356815 -1.381082
C  -1.682814 -1.919992 0.064277
C  -3.013912 -0.828112 -1.600839
C  -2.69817 -1.970116 -0.88713
C  -2.218768 -3.938295 1.157358
C  -1.926299 -5.276366 0.94419
C  -3.395833 -3.562949 1.792658
C  -2.81975 -6.246351 1.373857
C  -4.283268 -4.542161 2.20923
C  -4.002068 -5.885217 2.001551
H  3.118475 1.089903 -0.735093
H  4.31761 4.629671 -2.917945
H  2.922248 3.716777 -3.475828
H  2.788106 4.732699 -2.054418
H  5.07967 1.041505 -2.096096
H  4.289022 1.68172 -3.52431
H  5.722197 2.478209 -2.882203
H  6.216559 2.745695 0.256314
H  5.067965 2.113854 1.431767
H  5.399484 1.215159 -0.036698
H  3.117781 4.9136 -0.011142
H  3.679793 4.141899 1.456493
H  4.834989 4.905613 0.371083
H  -0.954335 2.462478 -0.863707
H  -0.212891 -0.721399 1.045064
H  -2.579709 1.243838 -1.94752
H  -3.800247 -0.865036 -2.342547
H  -3.233679 -2.892334 -1.070824
H  -1.002642 -5.549801 0.451274
H  -3.61398 -2.517084 1.96792
H  -2.590059 -7.290697 1.209022
H  -5.198283 -4.250276 2.707358
H  -4.698123 -6.644254 2.331453
totalener: -1132.67512461 hartree
nucrepener: 2157.77121615 hartree
electener: -3290.44634076 hartree
oneelecener: -5824.18781486 hartree
twoeener: 2533.74147410 hartree
kineticenergy: 1127.72571395 hartree
xcener: -110.665696621241 hartree
chargesum: 0.0000000
charge: -0.276448 -0.383732 -0.297239 -0.002569 0.081386 0.079844 -0.117255 -0.275285 -0.255350 -0.255926 -0.272788 0.338880 0.347615 0.045350 -0.275598 -0.186531 -0.142501 0.171624 -0.120553 -0.138004 0.210910 -0.193846 -0.142605 -0.099574 -0.121172 -0.135056 0.075289 0.088875 0.085928 0.106564 0.077556 0.089654 0.092799 0.091996 0.092887 0.076631 0.106701 0.092511 0.087497 0.102702 0.123078 0.113661 0.129493 0.135347 0.126919 0.137675 0.126020 0.129671 0.126966
qa: -0.2764 -0.3837 -0.2972 -0.0026 0.0814 0.0798 -0.1173 -0.2753 -0.2554 -0.2559 -0.2728 0.3389 0.3476 0.0454 -0.2756 -0.1865 -0.1425 0.1716 -0.1206 -0.1380 0.2109 -0.1938 -0.1426 -0.0996 -0.1212 -0.1351 0.0753 0.0889 0.0859 0.1066 0.0776 0.0897 0.0928 0.0920 0.0929 0.0766 0.1067 0.0925 0.0875 0.1027 0.1231 0.1137 0.1295 0.1353 0.1269 0.1377 0.1260 0.1297 0.1270
va: 2.1561 2.1089 2.1043 3.1208 3.7266 3.7335 3.9414 3.9200 3.9062 3.9051 3.9230 4.1646 3.8193 3.7396 4.0047 4.0897 3.9751 3.9152 3.9811 3.9360 3.8293 4.0298 3.9398 3.9391 3.9465 3.9528 1.0309 0.9993 1.0032 1.0175 1.0101 1.0060 1.0010 1.0012 1.0060 1.0099 1.0163 1.0035 0.9984 1.0317 1.0303 1.0110 1.0020 1.0028 1.0126 1.0020 0.9990 0.9996 0.9999
dispcorr: -0.022618478 hartree
energy: -1132.697743090812
dipole: 26.85248 -26.56860 0.28388 11.95047 -13.15282 -1.20235 -10.07516 8.70131 -1.37385
magnitude: 1.84762 au
magnitude: 4.69628 debye
