program: Orca
programVersion: 5.0.2
elementType: O O O N C C C C C C C C C C C C C C C C C C C C C C H H H H H H H H H H H H H H H H H H H H H H H
charge: 0
multiplicity: 1
keywords: wb97x-d3
keywords: def2-TZVPP
keywords: def2/J RIJCOSX
keywords: DEFGRID2
keywords: scfconv7
keywords: smallprint printgap noloewdin
keywords: NOSOSCF
formula: C22H23NO3
InChI: InChI=1/C22H23NO3/c1-21(2)19(22(21,3)4)20(24)26-18(14-23)15-9-8-12-17(13-15)25-16-10-6-5-7-11-16/h5-13,18-19H,1-4H3
49 atoms
O  0.760853 1.934894 0.21521
O  1.111351 3.021863 -1.712174
O  -2.662411 -2.264909 1.448748
N  -1.819187 3.018836 2.009096
C  4.134192 2.419025 -1.226465
C  3.917215 3.654377 -0.410644
C  2.953251 2.477657 -0.2640
C  3.923281 2.436962 -2.724065
C  5.232815 1.446142 -0.852596
C  4.792351 3.93815 0.79191
C  3.467015 4.940958 -1.064781
C  1.550144 2.535044 -0.704402
C  -0.640186 1.896168 -0.034175
C  -1.075221 0.471733 -0.279985
C  -1.296121 2.515725 1.118906
C  -1.692954 -0.285308 0.698861
C  -0.797559 -0.085633 -1.526099
C  -2.039617 -1.6084 0.437244
C  -1.136988 -1.40271 -1.770079
C  -1.758098 -2.175761 -0.797537
C  -2.900874 -3.609191 1.331292
C  -4.155544 -4.043815 0.935213
C  -1.900788 -4.515904 1.649038
C  -4.412038 -5.405433 0.865481
C  -2.167706 -5.874367 1.574494
C  -3.420871 -6.322583 1.181781
H  3.081524 1.905218 0.647788
H  4.855459 2.723805 -3.214679
H  3.66198 1.439049 -3.080317
H  3.146721 3.113047 -3.063048
H  5.024301 0.464371 -1.280278
H  6.192686 1.780779 -1.25028
H  5.349214 1.309696 0.220408
H  5.062951 3.046638 1.353574
H  5.717534 4.429549 0.484582
H  4.277366 4.608955 1.481109
H  4.339567 5.495724 -1.414985
H  2.796966 4.807859 -1.907388
H  2.951354 5.570924 -0.337945
H  -0.880029 2.504695 -0.911346
H  -1.923856 0.132283 1.671281
H  -0.324349 0.508844 -2.297233
H  -0.926115 -1.841743 -2.736014
H  -2.022741 -3.202067 -1.013028
H  -4.923683 -3.320252 0.695252
H  -0.928051 -4.157572 1.960337
H  -5.392242 -5.748671 0.562416
H  -1.392344 -6.585141 1.827552
H  -3.625635 -7.383288 1.128351
totalener: -1132.67546773 hartree
nucrepener: 2160.71098975 hartree
electener: -3293.38645748 hartree
oneelecener: -5829.99760883 hartree
twoeener: 2536.61115134 hartree
kineticenergy: 1127.71458530 hartree
xcener: -110.664538514128 hartree
chargesum: -0.0000000
charge: -0.263340 -0.399001 -0.288737 -0.005826 0.090970 0.079006 -0.142492 -0.275999 -0.255190 -0.254534 -0.278934 0.371029 0.322371 0.001830 -0.260200 -0.198350 -0.161409 0.231801 -0.142483 -0.152655 0.175664 -0.145514 -0.134474 -0.123828 -0.127037 -0.113640 0.077355 0.088766 0.085581 0.105488 0.090171 0.091992 0.077749 0.077514 0.092495 0.092989 0.090052 0.104895 0.090661 0.128778 0.123252 0.133552 0.128320 0.127419 0.128783 0.129742 0.128302 0.128440 0.128678
qa: -0.2633 -0.3990 -0.2887 -0.0058 0.0910 0.0790 -0.1425 -0.2760 -0.2552 -0.2545 -0.2789 0.3710 0.3224 0.0018 -0.2602 -0.1983 -0.1614 0.2318 -0.1425 -0.1527 0.1757 -0.1455 -0.1345 -0.1238 -0.1270 -0.1136 0.0774 0.0888 0.0856 0.1055 0.0902 0.0920 0.0777 0.0775 0.0925 0.0930 0.0901 0.1049 0.0907 0.1288 0.1233 0.1336 0.1283 0.1274 0.1288 0.1297 0.1283 0.1284 0.1287
va: 2.1189 2.0930 2.1158 3.1182 3.7130 3.7358 3.9441 3.9201 3.9069 3.9062 3.9263 4.1433 3.7917 3.8289 4.0405 4.0874 3.9695 3.9165 3.9932 3.9252 3.8675 3.9991 3.9925 3.9428 3.9456 3.9320 1.0343 0.9995 1.0035 1.0173 1.0057 1.0011 1.0106 1.0101 1.0008 1.0062 0.9992 1.0160 1.0030 1.0313 1.0365 1.0160 1.0025 1.0113 1.0083 1.0054 0.9996 0.9997 0.9995
dispcorr: -0.022924416 hartree
energy: -1132.698392146965
dipole: 31.79057 -30.67386 1.11671 9.83955 -11.30692 -1.46737 -10.06069 9.18621 -0.87448
magnitude: 2.04082 au
magnitude: 5.18735 debye
