program: Orca
programVersion: 5.0.2
elementType: O O O N C C C C C C C C C C C C C C C C C C C C C C H H H H H H H H H H H H H H H H H H H H H H H
charge: 0
multiplicity: 1
keywords: wb97x-d3
keywords: def2-TZVPP
keywords: def2/J RIJCOSX
keywords: DEFGRID2
keywords: scfconv7
keywords: smallprint printgap noloewdin
keywords: NOSOSCF
formula: C22H23NO3
InChI: InChI=1/C22H23NO3/c1-21(2)19(22(21,3)4)20(24)26-18(14-23)15-9-8-12-17(13-15)25-16-10-6-5-7-11-16/h5-13,18-19H,1-4H3
49 atoms
O  0.430945 1.865269 0.502472
O  0.454226 3.440334 -1.078841
O  -2.635847 -2.345991 -0.707599
N  -1.447371 1.544342 3.20008
C  3.434403 1.553296 0.232271
C  2.961682 0.826438 -0.990895
C  2.445076 2.23457 -0.701362
C  3.055877 1.079903 1.618919
C  4.823317 2.159895 0.246825
C  3.863277 0.691272 -2.199506
C  2.048068 -0.371998 -0.872248
C  1.03066 2.582878 -0.465646
C  -0.964783 2.071006 0.686482
C  -1.764438 1.184199 -0.236241
C  -1.225655 1.772306 2.096439
C  -1.819657 -0.184946 0.002672
C  -2.391532 1.7341 -1.342932
C  -2.506311 -1.005339 -0.880315
C  -3.088678 0.904061 -2.21004
C  -3.144661 -0.459213 -1.989614
C  -1.737043 -3.026254 0.068731
C  -0.381372 -3.018545 -0.231872
C  -2.221326 -3.767423 1.134102
C  0.491938 -3.753432 0.553427
C  -1.338383 -4.5101 1.904645
C  0.019061 -4.500452 1.623217
H  2.886275 2.994129 -1.337734
H  2.117733 0.540798 1.682872
H  3.838841 0.417036 1.99248
H  2.991253 1.925207 2.305482
H  4.889807 2.924705 1.022297
H  5.573236 1.398817 0.470904
H  5.102372 2.632873 -0.692611
H  4.547496 -0.150845 -2.077259
H  3.267319 0.503431 -3.094097
H  4.462463 1.57785 -2.394958
H  1.398295 -0.368083 -0.003712
H  1.409502 -0.446179 -1.755086
H  2.649697 -1.282479 -0.825277
H  -1.225363 3.1189 0.511655
H  -1.343453 -0.603221 0.881544
H  -2.327623 2.79657 -1.533953
H  -3.5854 1.324207 -3.074117
H  -3.683666 -1.109959 -2.665512
H  -0.013579 -2.447355 -1.074635
H  -3.281244 -3.763686 1.351215
H  1.548925 -3.74523 0.322095
H  -1.71616 -5.090844 2.735462
H  0.705091 -5.074757 2.230762
totalener: -1132.67085721 hartree
nucrepener: 2321.72474244 hartree
electener: -3454.39559966 hartree
oneelecener: -6151.74308471 hartree
twoeener: 2697.34748505 hartree
kineticenergy: 1127.73129062 hartree
xcener: -110.668583217082 hartree
chargesum: -0.0000000
charge: -0.259656 -0.363868 -0.296812 -0.002315 0.106766 0.106848 -0.148647 -0.254990 -0.270791 -0.258997 -0.318308 0.351177 0.280040 0.037117 -0.264489 -0.225598 -0.138894 0.242303 -0.087484 -0.204635 0.236716 -0.193302 -0.174261 -0.116646 -0.103990 -0.128394 0.079190 0.092545 0.085243 0.095251 0.093095 0.091961 0.078389 0.090762 0.092320 0.079296 0.083155 0.102246 0.096699 0.125499 0.133056 0.120905 0.127871 0.128013 0.149730 0.126846 0.124535 0.127936 0.126570
qa: -0.2597 -0.3639 -0.2968 -0.0023 0.1068 0.1068 -0.1486 -0.2550 -0.2708 -0.2590 -0.3183 0.3512 0.2800 0.0371 -0.2645 -0.2256 -0.1389 0.2423 -0.0875 -0.2046 0.2367 -0.1933 -0.1743 -0.1166 -0.1040 -0.1284 0.0792 0.0925 0.0852 0.0953 0.0931 0.0920 0.0784 0.0908 0.0923 0.0793 0.0832 0.1022 0.0967 0.1255 0.1331 0.1209 0.1279 0.1280 0.1497 0.1268 0.1245 0.1279 0.1266
va: 2.1046 2.1426 2.1232 3.1140 3.6876 3.7624 3.9218 3.9170 3.9185 3.9114 3.9415 4.2243 3.8794 3.6277 4.0260 3.9550 4.0049 3.8610 3.9546 4.0370 3.8151 3.9603 4.0355 3.9490 3.9423 3.9708 1.0307 1.0094 1.0001 1.0055 1.0050 1.0006 1.0101 1.0012 1.0051 1.0112 0.9992 0.9974 0.9982 1.0202 1.0127 1.0208 0.9993 1.0124 0.9910 1.0119 1.0020 0.9990 1.0002
dispcorr: -0.027523040 hartree
energy: -1132.698380254325
dipole: 28.23199 -27.25478 0.97720 -1.59136 0.89551 -0.69585 -4.45076 3.55305 -0.89771
magnitude: 1.49834 au
magnitude: 3.80848 debye
