program: Orca
programVersion: 5.0.2
elementType: O O O N C C C C C C C C C C C C C C C C C C C C C C H H H H H H H H H H H H H H H H H H H H H H H
charge: 0
multiplicity: 1
keywords: wb97x-d3
keywords: def2-TZVPP
keywords: def2/J RIJCOSX
keywords: DEFGRID2
keywords: scfconv7
keywords: smallprint printgap noloewdin
keywords: NOSOSCF
formula: C22H23NO3
InChI: InChI=1/C22H23NO3/c1-21(2)19(22(21,3)4)20(24)26-18(14-23)15-9-8-12-17(13-15)25-16-10-6-5-7-11-16/h5-13,18-19H,1-4H3
49 atoms
O  0.372893 1.892977 0.539052
O  0.369838 3.452131 -1.057274
O  -2.552102 -2.390651 -0.818044
N  -1.568781 1.468848 3.1782
C  3.400795 1.737606 0.356756
C  2.997647 0.952342 -0.855355
C  2.400397 2.337965 -0.619831
C  3.01305 1.282617 1.746777
C  4.75277 2.42253 0.387733
C  3.935376 0.831401 -2.037628
C  2.145451 -0.289536 -0.724829
C  0.966744 2.625965 -0.420983
C  -1.034125 2.048415 0.687155
C  -1.782125 1.152776 -0.270105
C  -1.322574 1.718663 2.084471
C  -1.809943 -0.220688 -0.051352
C  -2.390609 1.702738 -1.387143
C  -2.447724 -1.045063 -0.966975
C  -3.03892 0.868374 -2.286972
C  -3.065347 -0.498985 -2.087824
C  -1.665897 -3.072396 -0.029849
C  -2.178069 -3.889365 0.965102
C  -0.296945 -3.000009 -0.252331
C  -1.311112 -4.643336 1.742411
C  0.559337 -3.747163 0.540433
C  0.058309 -4.571098 1.538493
H  2.817149 3.101917 -1.267315
H  2.103062 0.696275 1.803846
H  3.820319 0.673506 2.15815
H  2.887142 2.142057 2.406847
H  4.751452 3.218451 1.134169
H  5.536629 1.714473 0.663608
H  5.034502 2.875264 -0.560805
H  3.372666 0.591467 -2.941239
H  4.49548 1.741271 -2.241752
H  4.656611 0.027815 -1.875369
H  1.47337 -0.29567 0.126622
H  1.535704 -0.420178 -1.621421
H  2.791639 -1.165816 -0.637916
H  -1.324487 3.090087 0.522187
H  -1.351031 -0.639953 0.836141
H  -2.349064 2.769132 -1.560855
H  -3.519919 1.288579 -3.159846
H  -3.566106 -1.153319 -2.789217
H  -3.247677 -3.935047 1.12143
H  0.095934 -2.370316 -1.040223
H  -1.711699 -5.283679 2.51686
H  1.62623 -3.688565 0.369691
H  0.731729 -5.154971 2.151053
totalener: -1132.67083396 hartree
nucrepener: 2317.35537226 hartree
electener: -3450.02620622 hartree
oneelecener: -6143.00571622 hartree
twoeener: 2692.97951000 hartree
kineticenergy: 1127.72817539 hartree
xcener: -110.668079545013 hartree
chargesum: 0.0000000
charge: -0.260447 -0.364881 -0.296195 -0.002184 0.105853 0.104188 -0.147895 -0.255928 -0.270042 -0.257599 -0.321647 0.355158 0.280377 0.038300 -0.265954 -0.230266 -0.138697 0.250389 -0.086674 -0.208953 0.244784 -0.181817 -0.198477 -0.099718 -0.113838 -0.132325 0.079413 0.092917 0.085608 0.094932 0.093289 0.091882 0.078376 0.092142 0.079314 0.090707 0.086959 0.101724 0.096746 0.125972 0.132736 0.120709 0.127758 0.128203 0.126193 0.150463 0.127537 0.124780 0.126127
qa: -0.2604 -0.3649 -0.2962 -0.0022 0.1059 0.1042 -0.1479 -0.2559 -0.2700 -0.2576 -0.3216 0.3552 0.2804 0.0383 -0.2660 -0.2303 -0.1387 0.2504 -0.0867 -0.2090 0.2448 -0.1818 -0.1985 -0.0997 -0.1138 -0.1323 0.0794 0.0929 0.0856 0.0949 0.0933 0.0919 0.0784 0.0921 0.0793 0.0907 0.0870 0.1017 0.0967 0.1260 0.1327 0.1207 0.1278 0.1282 0.1262 0.1505 0.1275 0.1248 0.1261
va: 2.1048 2.1416 2.1244 3.1143 3.6901 3.7602 3.9230 3.9183 3.9185 3.9105 3.9405 4.2188 3.8798 3.6238 4.0255 3.9622 4.0068 3.8570 3.9541 4.0395 3.8102 4.0401 3.9600 3.9398 3.9477 3.9742 1.0306 1.0092 1.0002 1.0052 1.0050 1.0008 1.0102 1.0053 1.0113 1.0012 1.0005 0.9976 0.9991 1.0188 1.0127 1.0217 0.9994 1.0124 1.0125 0.9913 0.9990 1.0017 1.0004
dispcorr: -0.027336007 hartree
energy: -1132.698169969559
dipole: 28.56525 -27.53400 1.03126 -0.36520 -0.25484 -0.62003 -3.39353 2.52479 -0.86874
magnitude: 1.48413 au
magnitude: 3.77236 debye
