program: Orca
programVersion: 5.0.2
elementType: O O O N C C C C C C C C C C C C C C C C C C C C C C H H H H H H H H H H H H H H H H H H H H H H H
charge: 0
multiplicity: 1
keywords: wb97x-d3
keywords: def2-TZVPP
keywords: def2/J RIJCOSX
keywords: DEFGRID2
keywords: scfconv7
keywords: smallprint printgap noloewdin
keywords: NOSOSCF
formula: C22H23NO3
InChI: InChI=1/C22H23NO3/c1-21(2)19(22(21,3)4)20(24)26-18(14-23)15-9-8-12-17(13-15)25-16-10-6-5-7-11-16/h5-13,18-19H,1-4H3
49 atoms
O  0.779025 1.294809 0.56311
O  0.81476 2.962041 -0.925845
O  -2.520717 -2.744519 -0.637892
N  -1.045729 0.978062 3.315245
C  3.591608 1.835368 -1.799857
C  3.944871 2.63945 -0.587392
C  2.788604 1.643572 -0.520577
C  2.983322 2.497963 -3.015219
C  4.459695 0.662814 -2.208038
C  5.168053 2.285181 0.230446
C  3.676527 4.126721 -0.544667
C  1.387625 2.067744 -0.363355
C  -0.597542 1.550761 0.804923
C  -1.477494 0.728683 -0.104443
C  -0.831397 1.224102 2.214136
C  -1.573895 -0.644371 0.091885
C  -2.152702 1.342647 -1.147902
C  -2.381047 -1.398879 -0.74668
C  -2.944171 0.574105 -1.990004
C  -3.067635 -0.788277 -1.791691
C  -2.33228 -3.378105 0.559566
C  -1.562504 -4.531039 0.554143
C  -2.93221 -2.933163 1.730892
C  -1.393326 -5.244896 1.730781
C  -2.743046 -3.648514 2.902565
C  -1.975586 -4.804505 2.909441
H  3.01148 0.73462 0.027317
H  2.378071 1.780398 -3.571496
H  2.350017 3.350492 -2.798163
H  3.783088 2.833155 -3.67862
H  3.894091 -0.016128 -2.848103
H  5.325229 1.007087 -2.777424
H  4.828312 0.077721 -1.367864
H  6.062815 2.73302 -0.206439
H  5.068111 2.673696 1.245139
H  5.341649 1.214403 0.312563
H  4.527113 4.663265 -0.969253
H  2.786107 4.438853 -1.080088
H  3.566253 4.458698 0.489271
H  -0.821096 2.613052 0.668765
H  -1.032848 -1.116322 0.903267
H  -2.055922 2.408013 -1.307468
H  -3.477325 1.043941 -2.805443
H  -3.692417 -1.389807 -2.438707
H  -1.108119 -4.865138 -0.369282
H  -3.539581 -2.03718 1.733406
H  -0.795131 -6.146405 1.724256
H  -3.203695 -3.297121 3.816048
H  -1.834892 -5.358349 3.827551
totalener: -1132.67616719 hartree
nucrepener: 2220.00951031 hartree
electener: -3352.68567750 hartree
oneelecener: -5948.76456591 hartree
twoeener: 2596.07888841 hartree
kineticenergy: 1127.72735579 hartree
xcener: -110.667973739033 hartree
chargesum: 0.0000000
charge: -0.268598 -0.400329 -0.295758 -0.007702 0.083320 0.076582 -0.117008 -0.270011 -0.257227 -0.254607 -0.279301 0.355574 0.339916 0.006210 -0.264023 -0.204975 -0.140012 0.242295 -0.088061 -0.209436 0.260844 -0.213537 -0.184659 -0.088612 -0.096973 -0.145377 0.075360 0.088660 0.103406 0.087079 0.090386 0.092897 0.077652 0.092516 0.091797 0.077756 0.090508 0.103823 0.089811 0.116948 0.129713 0.119204 0.127272 0.126957 0.123776 0.134816 0.125230 0.129797 0.126103
qa: -0.2686 -0.4003 -0.2958 -0.0077 0.0833 0.0766 -0.1170 -0.2700 -0.2572 -0.2546 -0.2793 0.3556 0.3399 0.0062 -0.2640 -0.2050 -0.1400 0.2423 -0.0881 -0.2094 0.2608 -0.2135 -0.1847 -0.0886 -0.0970 -0.1454 0.0754 0.0887 0.1034 0.0871 0.0904 0.0929 0.0777 0.0925 0.0918 0.0778 0.0905 0.1038 0.0898 0.1169 0.1297 0.1192 0.1273 0.1270 0.1238 0.1348 0.1252 0.1298 0.1261
va: 2.1314 2.0924 2.1204 3.1181 3.7228 3.7391 3.9303 3.9181 3.9085 3.9057 3.9246 4.1629 3.8176 3.6850 4.0263 3.9931 3.9854 3.8477 3.9507 4.0371 3.7822 4.0511 3.9668 3.9281 3.9439 3.9654 1.0334 1.0034 1.0175 0.9990 1.0061 1.0010 1.0103 1.0007 1.0062 1.0103 0.9995 1.0167 1.0026 1.0254 1.0155 1.0201 0.9998 1.0127 1.0141 1.0031 0.9990 0.9996 1.0005
dispcorr: -0.023574095 hartree
energy: -1132.699741285090
dipole: 29.24448 -28.46342 0.78106 11.13685 -11.31082 -0.17397 -11.11469 10.11441 -1.00029
magnitude: 1.28097 au
magnitude: 3.25598 debye
