program: Gaussian 09
title: 000072282
version: EM64L-G09RevD.01
frameworkgroup: C1[X(C15H12O6)]
method: RPBEPBE
basis: SDD
operation: Freq
keyword: #pfreq=noraman
keyword: PBEPBE/SDD
title: #p freq=noraman PBEPBE/SDD
converged: YES YES NO NO
title: Mulliken charges:
elementType: O O O O O O C C C C C C C C C C C C C C C H H H H H H H H H H H H
charge: -0.291734 -0.405532 -0.205268 -0.435846 -0.417288 -0.484013 -0.289536 -0.253319 0.561586 0.116345 0.201427 0.261792 -0.542768 -0.382726 -0.347956 -0.513088 0.183863 0.333422 -0.409090 -0.335967 0.132163 0.246783 0.283814 0.256558 0.243856 0.278427 0.284218 0.352287 0.230366 0.222307 0.385959 0.363786 0.375173
chargesum: 0.00000
title: Mulliken charges with hydrogens summed into heavy atoms:
elementType: O O O O O O C C C C C C C C C C C C C C C
charge: -0.291734 -0.053245 -0.205268 -0.049887 -0.053502 -0.108840 -0.042753 0.030495 0.561586 0.116345 0.201427 0.261792 -0.286210 -0.138870 -0.069529 -0.228870 0.183863 0.333422 -0.178724 -0.113660 0.132163
polarizability: 2.84763409e+02 -1.03841057e+01 1.78555951e+02 -5.61043649e+00 -1.70042883e+01 1.12111888e+02
1716.lowfreq: -7.1467 -2.6302 -0.0008 -0.0005 0.0003 2.3490 19.1037 47.5114 51.4541
frequency: 18.7134 47.4852 51.4289 72.4433 100.1939 141.5266 171.4509 187.9973 206.5665 224.0843 235.2707 242.1033 273.2571 279.7329 287.7011 301.4550 313.3318 350.3639 373.5457 397.1977 433.0971 440.2352 449.1822 457.8959 468.3553 486.1170 535.7178 557.2984 566.2375 616.2045 619.3761 642.3932 666.7553 691.7386 714.8311 725.0024 752.0147 760.2631 763.7465 797.5902 807.3932 821.3529 841.7535 872.1527 881.5130 920.5372 926.0731 946.1729 970.1618 973.4712 1026.3420 1040.8188 1072.8607 1100.4526 1136.6386 1144.9399 1158.9868 1173.2599 1183.4196 1196.8780 1216.8138 1239.8468 1244.5066 1268.5344 1271.9160 1294.4244 1299.3025 1316.0018 1335.0406 1362.2903 1397.9369 1412.5519 1448.2910 1470.0962 1489.5130 1507.9692 1570.5428 1594.3665 1613.1775 1635.0852 1637.9032 2980.9552 3094.1464 3124.8632 3127.8520 3148.0930 3159.8323 3177.4328 3188.2523 3528.6233 3529.4691 3579.8296 3623.6685
redmass: 6.0038 6.2792 6.3600 6.8097 7.5727 6.0594 5.9639 7.7022 6.6625 3.4902 5.2552 5.8227 1.3325 3.0160 4.0270 5.8706 1.7532 6.8181 5.5191 1.1186 3.5004 4.3135 4.1260 5.1000 4.4185 1.1108 7.8669 5.3876 6.2477 5.1158 5.4196 6.2545 4.9912 3.9800 4.1330 7.0593 3.5080 4.6591 3.9115 1.6156 2.1431 3.0653 4.5317 1.5700 1.5605 2.4830 1.6902 3.3550 1.4253 3.1965 3.7194 6.2406 2.2101 1.9037 1.4031 1.2148 1.5204 1.5623 1.3868 1.3715 1.5950 1.5376 1.9329 2.7679 2.4784 2.0129 1.4513 1.9986 1.6184 1.2183 5.5704 5.1170 4.0513 3.2611 3.3557 3.4125 7.6417 9.8725 7.1214 6.7020 7.2653 1.0843 1.0874 1.0902 1.0894 1.0922 1.0956 1.0942 1.0929 1.0649 1.0657 1.0661 1.0666
irintensity: 0.9428 4.6601 0.7271 0.7293 2.4543 0.7466 1.9855 9.7467 4.0490 24.9585 1.3701 3.4405 129.6433 43.0676 43.2671 0.4786 130.3538 2.3804 7.4956 143.0210 7.9355 7.7650 7.0165 1.8139 8.0558 132.9762 1.4328 55.6456 1.1249 13.2202 6.0574 5.7443 9.0191 1.6842 1.4394 1.8713 36.9241 42.8570 17.6766 30.5094 13.1315 31.1544 15.2845 37.2418 14.1086 14.9723 5.1985 63.9475 7.0669 123.6859 63.1058 18.6921 266.3078 343.5711 31.6124 13.2970 66.7046 60.6058 67.9435 40.6042 13.3902 52.8479 75.8078 90.4776 129.3461 19.9059 34.5961 24.0369 120.7038 55.8142 121.7885 9.7797 96.5824 3.1428 0.4935 133.7607 49.2855 379.7843 37.9998 14.6248 250.5209 16.7122 8.3559 18.1666 10.3511 2.4401 6.8638 4.0460 0.2245 95.9259 7.5922 74.6472 69.6772
temp: 298.150 k
press: 1.00000 atm
elementType: 8 8 8 8 8 8 6 6 6 6 6 6 6 6 6 6 6 6 6 6 6 1 1 1 1 1 1 1 1 1 1 1 1
symmnumber: 1
zpe: 631055.3 jmol-1
zpe.correction: 0.240356 hartree
zpe.thermalcorrener: 0.258707 hartree
zpe.thermalcorrenthalpy: 0.259651 hartree
zpe.thermalcorrgfe: 0.193566 hartree
zpe.sumelectzpe: -1028.620471 hartree
zpe.sumelectthermal: -1028.602121 hartree
zpe.sumelectthermalent: -1028.601176 hartree
zpe.sumelectthermalfe: -1028.667261 hartree
dipole: 0.9289 -4.8518 0.6239
dipole: 4.9791
quadrupole: -76.6191 -134.4990 -122.7216
quadrupole: 4.0366 -12.0248 -9.4156
quadrupole: 34.6608 -23.2191 -11.4417 4.0366 -12.0248 -9.4156
hfenergy: -1028.8608277 hartree
pointgroup: C01 [X(C15H12O6)]
dipole: -0.3523488 1.8698451 0.4658124 debye
polarizability: 284.6135662|-11.7102412|173.8900918|4.4251198|24.1896329|116.9275887 unknown
InChI: InChI=1S/C15H12O6/c16-8-2-3-9-12(6-8)21-15(14(20)13(9)19)7-1-4-10(17)11(18)5-7/h1-6,14-18,20H
charge 0 multiplicity 1
33 atoms
O  -0.610433 0.788225 0.09425
O  -0.049478 -1.542776 1.75081
O  -1.994497 -3.147303 -0.318161
O  5.057545 -0.535479 -1.653121
O  -5.01826 2.61962 -0.086249
O  5.806706 0.959468 0.464857
C  0.280255 -0.313084 -0.403077
C  -0.155724 -1.631612 0.287577
C  1.712966 0.09578 -0.145691
C  -1.615109 -1.960098 -0.104697
C  -2.514119 -0.78444 -0.153744
C  -1.988363 0.540214 -0.025579
C  2.717963 -0.373588 -1.027266
C  2.069569 0.886345 0.971206
C  -3.92023 -0.940342 -0.28335
C  -2.833229 1.66439 -0.001318
C  4.068121 -0.070198 -0.783478
C  -4.225031 1.469371 -0.115343
C  -4.77998 0.165163 -0.265225
C  3.425484 1.204954 1.213532
C  4.418172 0.721131 0.343519
H  0.100859 -0.421433 -1.493187
H  0.503435 -2.464307 -0.003246
H  2.473332 -0.976733 -1.908406
H  1.292547 1.276801 1.632607
H  -4.309149 -1.959211 -0.382548
H  -2.420878 2.671992 0.085862
H  -0.435942 -0.675415 2.043277
H  -5.86464 0.030892 -0.357389
H  3.700217 1.822976 2.077402
H  5.942827 -0.221479 -1.329387
H  -5.977186 2.397033 -0.188058
H  6.02255 1.497342 1.263321
