program: Orca
programVersion: 5.0.2
elementType: O O O N C C C C C C C C C C C C C C C C C C C C C C H H H H H H H H H H H H H H H H H H H H H H H
charge: 0
multiplicity: 1
keywords: wb97x-d3
keywords: def2-TZVPP
keywords: def2/J RIJCOSX
keywords: DEFGRID2
keywords: scfconv7
keywords: smallprint printgap noloewdin
keywords: NOSOSCF
formula: C22H23NO3
InChI: InChI=1/C22H23NO3/c1-21(2)19(22(21,3)4)20(24)26-18(14-23)15-9-8-12-17(13-15)25-16-10-6-5-7-11-16/h5-13,18-19H,1-4H3
49 atoms
O  0.158529 2.735568 0.460039
O  0.68829 2.133957 -1.622941
O  -1.502902 -1.913605 1.259026
N  -2.44208 3.982448 2.044375
C  3.045663 0.716795 -0.003817
C  3.649994 1.932792 -0.632439
C  2.344038 2.075144 0.131233
C  2.433098 -0.373585 -0.851689
C  3.623949 0.148725 1.272639
C  4.846279 2.591756 0.021419
C  3.711691 2.087874 -2.135383
C  1.033852 2.306723 -0.480117
C  -1.203609 2.78932 0.075144
C  -1.803181 1.415618 -0.134027
C  -1.882469 3.462351 1.184653
C  -1.377453 0.348028 0.645939
C  -2.775901 1.235456 -1.105235
C  -1.931933 -0.904629 0.439433
C  -3.33369 -0.022644 -1.286941
C  -2.918174 -1.099713 -0.520918
C  -1.286871 -3.165433 0.734215
C  -0.655582 -3.350591 -0.48965
C  -1.673511 -4.249997 1.507364
C  -0.425081 -4.642635 -0.940338
C  -1.424798 -5.536197 1.048926
C  -0.807139 -5.738624 -0.177396
H  2.434121 2.518417 1.116875
H  3.193673 -1.122402 -1.080896
H  1.636278 -0.878613 -0.300243
H  2.014125 -0.039506 -1.79621
H  3.957335 0.909919 1.974806
H  2.876296 -0.459832 1.784833
H  4.475794 -0.497472 1.050417
H  4.776931 2.638766 1.106414
H  5.763644 2.056771 -0.232403
H  4.953341 3.616476 -0.339214
H  3.646096 3.14161 -2.41192
H  4.676604 1.720449 -2.490006
H  2.942023 1.555345 -2.684213
H  -1.348721 3.402915 -0.820246
H  -0.616754 0.471153 1.407125
H  -3.094899 2.068274 -1.718702
H  -4.097818 -0.169383 -2.03822
H  -3.359764 -2.07622 -0.672915
H  -0.342155 -2.503993 -1.08811
H  -2.160031 -4.088681 2.46081
H  0.062812 -4.789442 -1.894964
H  -1.724792 -6.38222 1.653132
H  -0.622409 -6.74245 -0.5356
elementType: O N C H
totalener: -1132.68347790 hartree
nucrepener: 2276.26004497 hartree
electener: -3408.94352287 hartree
oneelecener: -6061.42756536 hartree
twoeener: 2652.48404249 hartree
cpcmener: -0.03399885 hartree
kineticenergy: 1127.65520077 hartree
xcener: -110.660062762090 hartree
chargesum: -0.0000000
charge: -0.292306 -0.465944 -0.341181 -0.102333 0.110885 0.113163 -0.105612 -0.300599 -0.283384 -0.287603 -0.303869 0.354234 0.419125 0.017542 -0.223757 -0.241420 -0.204159 0.237538 -0.130514 -0.166689 0.291988 -0.186397 -0.245001 -0.169241 -0.128991 -0.182127 0.089206 0.107935 0.086949 0.100600 0.093281 0.095952 0.100814 0.092881 0.100235 0.096122 0.102492 0.096597 0.095895 0.147010 0.139214 0.149911 0.164311 0.161845 0.160925 0.148285 0.162337 0.161779 0.162074
qa: -0.2923 -0.4659 -0.3412 -0.1023 0.1109 0.1132 -0.1056 -0.3006 -0.2834 -0.2876 -0.3039 0.3542 0.4191 0.0175 -0.2238 -0.2414 -0.2042 0.2375 -0.1305 -0.1667 0.2920 -0.1864 -0.2450 -0.1692 -0.1290 -0.1821 0.0892 0.1079 0.0869 0.1006 0.0933 0.0960 0.1008 0.0929 0.1002 0.0961 0.1025 0.0966 0.0959 0.1470 0.1392 0.1499 0.1643 0.1618 0.1609 0.1483 0.1623 0.1618 0.1621
va: 2.1018 2.0312 2.0503 3.1113 3.7136 3.7245 3.8929 3.9171 3.9031 3.9056 3.8982 4.1418 3.7064 3.6167 4.0837 4.0120 3.9881 3.7775 3.8925 3.9081 3.6540 3.8753 4.0066 3.9186 3.8843 3.8938 1.0327 1.0005 0.9975 1.0108 1.0052 1.0024 0.9990 1.0049 0.9988 1.0021 0.9990 0.9985 1.0121 1.0155 1.0264 1.0009 0.9887 0.9932 0.9942 1.0075 0.9901 0.9879 0.9888
dispcorr: -0.025742279 hartree
energy: -1132.709220181549
dipole: 28.16981 -26.85878 1.31103 -5.33477 3.84078 -1.49399 -7.20504 6.05449 -1.15055
magnitude: 2.29665 au
magnitude: 5.83761 debye
