program: Orca
programVersion: 5.0.2
elementType: O O O N C C C C C C C C C C C C C C C C C C C C C C H H H H H H H H H H H H H H H H H H H H H H H
charge: 0
multiplicity: 1
keywords: wb97x-d3
keywords: def2-TZVPP
keywords: def2/J RIJCOSX
keywords: DEFGRID2
keywords: scfconv7
keywords: smallprint printgap noloewdin
keywords: NOSOSCF
formula: C22H23NO3
InChI: InChI=1/C22H23NO3/c1-21(2)19(22(21,3)4)20(24)26-18(14-23)15-9-8-12-17(13-15)25-16-10-6-5-7-11-16/h5-13,18-19H,1-4H3
49 atoms
O  0.50154 1.66537 0.751616
O  0.705083 2.584767 -1.270586
O  -2.048948 -2.590055 -0.785804
N  -1.747008 1.696161 3.163755
C  3.474579 1.071218 -1.314815
C  3.805071 2.4039 -0.726418
C  2.619467 1.616555 -0.168427
C  2.912243 0.954525 -2.712596
C  4.315201 -0.139267 -0.97177
C  4.983833 2.542488 0.212747
C  3.59718 3.676499 -1.513632
C  1.221799 2.020537 -0.337164
C  -0.889676 1.948232 0.707146
C  -1.649074 1.003224 -0.194699
C  -1.351594 1.805027 2.089279
C  -1.480402 -0.367281 -0.037618
C  -2.501626 1.507399 -1.165391
C  -2.192318 -1.231832 -0.855786
C  -3.198917 0.62839 -1.982203
C  -3.053273 -0.740304 -1.829369
C  -1.863268 -3.205599 0.428825
C  -2.598235 -2.853446 1.554132
C  -0.950074 -4.248427 0.473503
C  -2.402006 -3.555433 2.734524
C  -0.774287 -4.949893 1.657931
C  -1.492771 -4.603501 2.793846
H  2.807939 1.144019 0.78888
H  3.7351 0.818382 -3.417283
H  2.270856 0.074706 -2.790591
H  2.337289 1.810801 -3.050658
H  4.644105 -0.160283 0.064975
H  3.746762 -1.053805 -1.149573
H  5.203525 -0.177429 -1.605566
H  5.095513 1.702286 0.894862
H  5.91245 2.640533 -0.353127
H  4.874618 3.441813 0.821292
H  3.394304 4.510044 -0.838879
H  4.515723 3.913997 -2.05432
H  2.793902 3.641462 -2.242576
H  -1.076729 2.985305 0.410182
H  -0.803817 -0.752949 0.71623
H  -2.620002 2.57665 -1.284244
H  -3.864123 1.011699 -2.744014
H  -3.599401 -1.427565 -2.462665
H  -3.319718 -2.04683 1.517612
H  -0.388061 -4.512803 -0.413128
H  -2.972648 -3.281235 3.612026
H  -0.064834 -5.766269 1.690816
H  -1.349041 -5.147714 3.717476
elementType: O N C H
totalener: -1132.68440655 hartree
nucrepener: 2249.55001539 hartree
electener: -3382.23442194 hartree
oneelecener: -6008.39275991 hartree
twoeener: 2626.15833797 hartree
cpcmener: -0.03307688 hartree
kineticenergy: 1127.65263966 hartree
xcener: -110.659084459179 hartree
chargesum: -0.0000000
charge: -0.298726 -0.477379 -0.339357 -0.103771 0.100539 0.101541 -0.114702 -0.302955 -0.284854 -0.280681 -0.302516 0.389276 0.438593 0.016696 -0.222533 -0.206660 -0.205526 0.248285 -0.116843 -0.235209 0.287766 -0.192119 -0.253892 -0.145471 -0.123654 -0.189341 0.088735 0.100696 0.101667 0.098448 0.093799 0.096111 0.099818 0.093164 0.099569 0.094870 0.102088 0.099410 0.096643 0.142833 0.148384 0.149903 0.162369 0.151179 0.157447 0.149616 0.163329 0.161702 0.161709
qa: -0.2987 -0.4774 -0.3394 -0.1038 0.1005 0.1015 -0.1147 -0.3030 -0.2849 -0.2807 -0.3025 0.3893 0.4386 0.0167 -0.2225 -0.2067 -0.2055 0.2483 -0.1168 -0.2352 0.2878 -0.1921 -0.2539 -0.1455 -0.1237 -0.1893 0.0887 0.1007 0.1017 0.0984 0.0938 0.0961 0.0998 0.0932 0.0996 0.0949 0.1021 0.0994 0.0966 0.1428 0.1484 0.1499 0.1624 0.1512 0.1574 0.1496 0.1633 0.1617 0.1617
va: 2.1189 2.0260 2.0674 3.1091 3.7001 3.7066 3.9193 3.9098 3.9065 3.9050 3.9074 4.0997 3.7064 3.5890 4.0828 3.9438 3.9633 3.7501 3.8981 4.0062 3.6779 3.9051 4.0098 3.8848 3.8778 3.9021 1.0326 0.9983 0.9990 1.0117 1.0048 1.0026 0.9988 1.0052 0.9989 1.0025 0.9990 0.9981 1.0128 1.0167 1.0153 1.0027 0.9882 1.0038 0.9972 1.0071 0.9889 0.9879 0.9893
dispcorr: -0.024024024 hartree
energy: -1132.708430576302
dipole: 29.32033 -28.01965 1.30068 5.63257 -5.85578 -0.22322 -9.50056 8.62009 -0.88047
magnitude: 1.58645 au
magnitude: 4.03243 debye
