program: Orca
programVersion: 5.0.2
elementType: O O O N C C C C C C C C C C C C C C C C C C C C C C H H H H H H H H H H H H H H H H H H H H H H H
charge: 0
multiplicity: 1
keywords: wb97x-d3
keywords: def2-TZVPP
keywords: def2/J RIJCOSX
keywords: DEFGRID2
keywords: scfconv7
keywords: smallprint printgap noloewdin
keywords: NOSOSCF
formula: C22H23NO3
InChI: InChI=1/C22H23NO3/c1-21(2)19(22(21,3)4)20(24)26-18(14-23)15-9-8-12-17(13-15)25-16-10-6-5-7-11-16/h5-13,18-19H,1-4H3
49 atoms
O  0.158604 2.675751 0.590316
O  0.686769 2.190653 -1.523085
O  -1.516326 -2.005635 1.179183
N  -2.446047 3.852502 2.22122
C  3.121486 0.777148 -0.041511
C  3.663989 2.068878 -0.564463
C  2.357278 2.083586 0.214401
C  2.554272 -0.26502 -0.977322
C  3.735263 0.130052 1.179889
C  4.834503 2.725749 0.136206
C  3.702707 2.355673 -2.047817
C  1.035907 2.310778 -0.374525
C  -1.202918 2.745218 0.207198
C  -1.80397 1.383277 -0.06582
C  -1.884623 3.368346 1.342222
C  -1.37788 0.278492 0.660091
C  -2.78676 1.252526 -1.035118
C  -1.943937 -0.960617 0.405063
C  -3.35521 0.007588 -1.266642
C  -2.941642 -1.105312 -0.552364
C  -1.322487 -3.241638 0.611309
C  -1.672547 -4.346264 1.37515
C  -0.747305 -3.397274 -0.644656
C  -1.447127 -5.620481 0.873692
C  -0.540092 -4.67787 -1.137778
C  -0.888035 -5.792632 -0.385821
H  2.435113 2.446812 1.233252
H  3.347607 -0.953025 -1.274493
H  1.789249 -0.855074 -0.467956
H  2.111485 0.128031 -1.886564
H  4.046046 0.84396 1.939294
H  3.017575 -0.54758 1.646037
H  4.608969 -0.461172 0.898219
H  5.773707 2.266005 -0.176829
H  4.88255 3.783465 -0.128706
H  4.780497 2.668572 1.221412
H  4.671355 2.045254 -2.444857
H  2.937976 1.855291 -2.632139
H  3.609682 3.427975 -2.229053
H  -1.346512 3.399416 -0.65866
H  -0.609967 0.36339 1.419607
H  -3.107006 2.114273 -1.606724
H  -4.127878 -0.100112 -2.015739
H  -3.393708 -2.070509 -0.741524
H  -2.113056 -4.208209 2.355023
H  -0.459682 -2.536425 -1.235661
H  -1.719559 -6.480869 1.471146
H  -0.096228 -4.800635 -2.117259
H  -0.721577 -6.787217 -0.777485
elementType: O N C H
totalener: -1132.68373428 hartree
nucrepener: 2266.73237368 hartree
electener: -3399.41610796 hartree
oneelecener: -6042.39671035 hartree
twoeener: 2642.98060239 hartree
cpcmener: -0.03383248 hartree
kineticenergy: 1127.65011288 hartree
xcener: -110.659414546366 hartree
chargesum: 0.0000000
charge: -0.293677 -0.467766 -0.339836 -0.101923 0.103689 0.112356 -0.103326 -0.300359 -0.282952 -0.286039 -0.304378 0.358834 0.419416 0.017147 -0.224702 -0.238244 -0.205493 0.241812 -0.129213 -0.172383 0.296484 -0.249283 -0.191445 -0.126812 -0.162604 -0.185552 0.089347 0.106369 0.092354 0.099035 0.093425 0.096195 0.100559 0.100518 0.095522 0.093066 0.097184 0.096336 0.101911 0.146959 0.138055 0.149982 0.164237 0.161806 0.148385 0.158561 0.161508 0.162771 0.162165
qa: -0.2937 -0.4678 -0.3398 -0.1019 0.1037 0.1124 -0.1033 -0.3004 -0.2830 -0.2860 -0.3044 0.3588 0.4194 0.0171 -0.2247 -0.2382 -0.2055 0.2418 -0.1292 -0.1724 0.2965 -0.2493 -0.1914 -0.1268 -0.1626 -0.1856 0.0893 0.1064 0.0924 0.0990 0.0934 0.0962 0.1006 0.1005 0.0955 0.0931 0.0972 0.0963 0.1019 0.1470 0.1381 0.1500 0.1642 0.1618 0.1484 0.1586 0.1615 0.1628 0.1622
va: 2.1029 2.0291 2.0553 3.1117 3.7131 3.7203 3.8953 3.9176 3.9026 3.9041 3.8997 4.1323 3.7072 3.6211 4.0826 4.0178 3.9894 3.7747 3.8915 3.9133 3.6569 4.0045 3.8802 3.8832 3.9070 3.8956 1.0327 0.9999 0.9968 1.0116 1.0052 1.0024 0.9991 0.9987 1.0023 1.0049 0.9985 1.0126 0.9990 1.0159 1.0273 1.0010 0.9888 0.9929 1.0075 0.9966 0.9879 0.9896 0.9888
dispcorr: -0.025247015 hartree
energy: -1132.708981293272
dipole: 28.50157 -27.17601 1.32557 -4.12620 2.73252 -1.39368 -7.79104 6.56761 -1.22343
magnitude: 2.27953 au
magnitude: 5.79410 debye
