program: Orca
programVersion: 5.0.2
elementType: O O O N C C C C C C C C C C C C C C C C C C C C C C H H H H H H H H H H H H H H H H H H H H H H H
charge: 0
multiplicity: 1
keywords: wb97x-d3
keywords: def2-TZVPP
keywords: def2/J RIJCOSX
keywords: DEFGRID2
keywords: scfconv7
keywords: smallprint printgap noloewdin
keywords: NOSOSCF
formula: C22H23NO3
InChI: InChI=1/C22H23NO3/c1-21(2)19(22(21,3)4)20(24)26-18(14-23)15-9-8-12-17(13-15)25-16-10-6-5-7-11-16/h5-13,18-19H,1-4H3
49 atoms
O  0.077912 2.153351 -1.125025
O  0.431167 1.591138 1.004949
O  -2.29527 -2.312034 -0.993652
N  -1.430568 4.322138 1.032227
C  3.483613 1.650326 0.13022
C  3.068809 0.23531 -0.102784
C  2.189476 1.365556 -0.637647
C  3.446081 2.248652 1.516586
C  4.592691 2.263637 -0.695759
C  3.761671 -0.5938 -1.161924
C  2.60045 -0.635989 1.037728
C  0.859402 1.684833 -0.119064
C  -1.258539 2.493572 -0.834525
C  -2.170524 1.310717 -0.561084
C  -1.337055 3.492879 0.240205
C  -1.771932 0.01847 -0.865128
C  -3.459501 1.547962 -0.092448
C  -2.662763 -1.029311 -0.66869
C  -4.339731 0.492722 0.078287
C  -3.945269 -0.808131 -0.199909
C  -1.259017 -2.898286 -0.311915
C  -0.925277 -2.551646 0.991523
C  -0.572959 -3.9082 -0.974642
C  0.105212 -3.230842 1.628262
C  0.451289 -4.578246 -0.323001
C  0.797479 -4.243478 0.979634
H  2.269012 1.521425 -1.707403
H  4.410327 2.085314 2.002208
H  3.290777 3.327307 1.460308
H  2.68245 1.840649 2.171107
H  4.583619 1.946901 -1.736625
H  4.506921 3.351747 -0.68803
H  5.567969 2.008377 -0.276564
H  3.994982 -0.036459 -2.066775
H  4.694901 -1.006215 -0.773034
H  3.128107 -1.433835 -1.45275
H  2.124236 -0.105965 1.856439
H  1.89461 -1.383055 0.672739
H  3.455525 -1.174089 1.452097
H  -1.61295 2.996264 -1.739188
H  -0.789206 -0.198007 -1.265623
H  -3.788325 2.555042 0.132019
H  -5.341298 0.683833 0.438916
H  -4.626078 -1.63749 -0.059455
H  -1.458496 -1.769802 1.516967
H  -0.843668 -4.167365 -1.99041
H  0.365307 -2.95964 2.64314
H  0.983521 -5.364333 -0.842398
H  1.599922 -4.765564 1.483025
elementType: O N C H
totalener: -1132.68274085 hartree
nucrepener: 2330.29246053 hartree
electener: -3462.97520138 hartree
oneelecener: -6169.99933218 hartree
twoeener: 2707.02413079 hartree
cpcmener: -0.03618704 hartree
kineticenergy: 1127.64833716 hartree
xcener: -110.663717971730 hartree
chargesum: 0.0000000
charge: -0.298963 -0.468327 -0.342493 -0.102952 0.098732 0.128387 -0.119631 -0.303294 -0.280011 -0.286911 -0.301161 0.385648 0.495308 -0.028214 -0.240400 -0.195305 -0.207580 0.226014 -0.132302 -0.197551 0.280764 -0.164938 -0.237370 -0.196266 -0.133333 -0.169277 0.089067 0.101811 0.101762 0.097185 0.092140 0.096133 0.100295 0.094407 0.099847 0.094570 0.103715 0.069262 0.105701 0.156885 0.149445 0.141438 0.162693 0.151400 0.153014 0.147578 0.161783 0.160379 0.160919
qa: -0.2990 -0.4683 -0.3425 -0.1030 0.0987 0.1284 -0.1196 -0.3033 -0.2800 -0.2869 -0.3012 0.3856 0.4953 -0.0282 -0.2404 -0.1953 -0.2076 0.2260 -0.1323 -0.1976 0.2808 -0.1649 -0.2374 -0.1963 -0.1333 -0.1693 0.0891 0.1018 0.1018 0.0972 0.0921 0.0961 0.1003 0.0944 0.0998 0.0946 0.1037 0.0693 0.1057 0.1569 0.1494 0.1414 0.1627 0.1514 0.1530 0.1476 0.1618 0.1604 0.1609
va: 2.1271 2.0236 2.0569 3.1015 3.7508 3.6667 3.9355 3.9118 3.8980 3.9063 3.8984 4.0663 3.7645 3.7333 4.0991 3.9844 3.9687 3.7660 3.8996 4.0071 3.6739 3.7980 3.9872 3.8747 3.8905 3.8413 1.0346 0.9979 0.9993 1.0127 1.0057 1.0022 0.9990 1.0055 0.9988 1.0022 1.0125 1.0104 1.0014 0.9895 1.0101 1.0094 0.9891 1.0019 1.0020 1.0077 0.9908 0.9879 0.9888
dispcorr: -0.027109007 hartree
energy: -1132.709849858417
dipole: 28.97551 -27.94403 1.03148 -4.13024 2.97662 -1.15362 1.97836 -3.67483 -1.69646
magnitude: 2.29626 au
magnitude: 5.83662 debye
