program: Orca
programVersion: 5.0.2
elementType: O O O N C C C C C C C C C C C C C C C C C C C C C C H H H H H H H H H H H H H H H H H H H H H H H
charge: 0
multiplicity: 1
keywords: wb97x-d3
keywords: def2-TZVPP
keywords: def2/J RIJCOSX
keywords: DEFGRID2
keywords: scfconv7
keywords: smallprint printgap noloewdin
keywords: NOSOSCF
formula: C22H23NO3
InChI: InChI=1/C22H23NO3/c1-21(2)19(22(21,3)4)20(24)26-18(14-23)15-9-8-12-17(13-15)25-16-10-6-5-7-11-16/h5-13,18-19H,1-4H3
49 atoms
O  0.692659 1.346131 0.443617
O  0.841141 2.901428 -1.15635
O  -2.377879 -2.759179 -0.647003
N  -1.141775 1.281775 3.186522
C  3.67203 1.730519 -1.781621
C  3.959084 2.463046 -0.510304
C  2.744374 1.530989 -0.590112
C  3.229443 2.476977 -3.019933
C  4.500141 0.519426 -2.156948
C  5.07549 2.002298 0.399829
C  3.765454 3.958327 -0.421309
C  1.366642 2.026234 -0.513513
C  -0.677881 1.667481 0.642462
C  -1.578309 0.787799 -0.189034
C  -0.92577 1.452314 2.069669
C  -1.542586 -0.589993 -0.003695
C  -2.420187 1.353379 -1.135014
C  -2.378855 -1.3959 -0.760211
C  -3.239513 0.530522 -1.8964
C  -3.229591 -0.841484 -1.709206
C  -2.192588 -3.343644 0.58432
C  -2.854192 -2.889067 1.718484
C  -1.36139 -4.451787 0.641876
C  -2.667227 -3.554905 2.920912
C  -1.193369 -5.115048 1.849765
C  -1.838706 -4.667184 2.993824
H  2.880952 0.593429 -0.063065
H  2.57437 1.853419 -3.630371
H  2.713761 3.412627 -2.832632
H  4.109347 2.708627 -3.623198
H  5.441171 0.826095 -2.617856
H  4.736492 -0.124249 -1.312162
H  3.961904 -0.088769 -2.88623
H  6.030391 2.417605 0.071202
H  4.899676 2.352023 1.418562
H  5.179565 0.920235 0.442406
H  2.947666 4.349069 -1.019548
H  3.582931 4.253053 0.613472
H  4.676995 4.463069 -0.747022
H  -0.878871 2.721668 0.431062
H  -0.873856 -1.027382 0.72883
H  -2.440999 2.426338 -1.274406
H  -3.900798 0.962349 -2.635255
H  -3.876796 -1.482732 -2.293583
H  -3.512368 -2.03056 1.671825
H  -0.855502 -4.795623 -0.251248
H  -3.180596 -3.201558 3.80542
H  -0.546862 -5.981493 1.894164
H  -1.700186 -5.181605 3.935302
elementType: O N C H
totalener: -1132.68427231 hartree
nucrepener: 2219.11798217 hartree
electener: -3351.80225448 hartree
oneelecener: -5947.45002223 hartree
twoeener: 2595.64776774 hartree
cpcmener: -0.03226209 hartree
kineticenergy: 1127.64825391 hartree
xcener: -110.657381482572 hartree
chargesum: -0.0000000
charge: -0.298892 -0.480248 -0.340210 -0.105661 0.106678 0.098796 -0.130878 -0.303137 -0.285669 -0.280255 -0.299409 0.404394 0.436215 0.021256 -0.223026 -0.198041 -0.199482 0.237714 -0.119935 -0.230696 0.279935 -0.187966 -0.247478 -0.146967 -0.126417 -0.186167 0.088696 0.102456 0.095085 0.097626 0.099401 0.093519 0.096185 0.099793 0.095659 0.092579 0.095628 0.101354 0.103910 0.135949 0.149384 0.150165 0.162868 0.150800 0.158267 0.149579 0.163325 0.161587 0.161732
qa: -0.2989 -0.4802 -0.3402 -0.1057 0.1067 0.0988 -0.1309 -0.3031 -0.2857 -0.2803 -0.2994 0.4044 0.4362 0.0213 -0.2230 -0.1980 -0.1995 0.2377 -0.1199 -0.2307 0.2799 -0.1880 -0.2475 -0.1470 -0.1264 -0.1862 0.0887 0.1025 0.0951 0.0976 0.0994 0.0935 0.0962 0.0998 0.0957 0.0926 0.0956 0.1014 0.1039 0.1359 0.1494 0.1502 0.1629 0.1508 0.1583 0.1496 0.1633 0.1616 0.1617
va: 2.1186 2.0214 2.0660 3.1055 3.6886 3.7231 3.9183 3.9025 3.9079 3.9034 3.9145 4.1037 3.7018 3.6119 4.0859 3.9528 3.9462 3.7671 3.8994 4.0074 3.6828 3.9029 4.0085 3.8852 3.8790 3.8986 1.0317 0.9993 1.0113 0.9985 0.9991 1.0051 1.0019 0.9989 1.0027 1.0053 1.0125 1.0000 0.9978 1.0235 1.0122 1.0041 0.9882 1.0040 0.9965 1.0065 0.9888 0.9879 0.9892
dispcorr: -0.023538748 hartree
energy: -1132.707811058242
dipole: 29.64646 -28.60743 1.03903 9.73816 -9.96931 -0.23115 -9.68529 8.63649 -1.04880
magnitude: 1.49432 au
magnitude: 3.79826 debye
