program: Orca
programVersion: 5.0.2
elementType: O O O N C C C C C C C C C C C C C C C C C C C C C C H H H H H H H H H H H H H H H H H H H H H H H
charge: 0
multiplicity: 1
keywords: wb97x-d3
keywords: def2-TZVPP
keywords: def2/J RIJCOSX
keywords: DEFGRID2
keywords: scfconv7
keywords: smallprint printgap noloewdin
keywords: NOSOSCF
formula: C22H23NO3
InChI: InChI=1/C22H23NO3/c1-21(2)19(22(21,3)4)20(24)26-18(14-23)15-9-8-12-17(13-15)25-16-10-6-5-7-11-16/h5-13,18-19H,1-4H3
49 atoms
O  0.05199 1.908007 0.671744
O  0.798738 1.768787 -1.430725
O  -2.691146 -2.309516 0.364633
N  -2.128394 3.937392 2.090501
C  3.17133 0.10954 -0.254134
C  3.606298 1.500635 0.075895
C  2.179468 1.057536 0.414021
C  2.997318 -0.329476 -1.690388
C  3.618297 -1.050415 0.60966
C  4.506127 1.755546 1.265026
C  3.850201 2.518453 -1.013557
C  0.993616 1.597541 -0.2535
C  -1.190031 2.38988 0.203847
C  -2.182525 1.283688 -0.097436
C  -1.703161 3.251152 1.271527
C  -1.932637 -0.025223 0.282864
C  -3.366187 1.618619 -0.745492
C  -2.87413 -1.005374 -0.012284
C  -4.304357 0.633683 -1.006364
C  -4.061809 -0.685323 -0.650249
C  -1.445144 -2.877154 0.232024
C  -0.982889 -3.660063 1.27896
C  -0.696381 -2.724017 -0.92834
C  0.244178 -4.298826 1.160558
C  0.530497 -3.3633 -1.029732
C  1.007774 -4.149088 0.011558
H  2.017429 0.868254 1.469106
H  2.814853 0.472434 -2.398088
H  3.904759 -0.842821 -2.013302
H  2.176068 -1.042413 -1.777313
H  2.949632 -1.901386 0.465288
H  4.623496 -1.371803 0.330168
H  3.62275 -0.821848 1.673485
H  5.550611 1.596109 0.990127
H  4.408621 2.791072 1.595483
H  4.286284 1.120352 2.120244
H  4.892691 2.465073 -1.332537
H  3.234211 2.398145 -1.899448
H  3.680026 3.525898 -0.629896
H  -1.068882 3.021796 -0.682692
H  -1.022967 -0.291942 0.805274
H  -3.553973 2.643541 -1.041504
H  -5.228536 0.889124 -1.507037
H  -4.787789 -1.458451 -0.86615
H  -1.578947 -3.771513 2.175655
H  -1.063518 -2.121137 -1.749535
H  0.60495 -4.910124 1.977203
H  1.113628 -3.248528 -1.933953
H  1.965611 -4.644028 -0.075539
elementType: O N C H
totalener: -1132.68369362 hartree
nucrepener: 2312.13812932 hartree
electener: -3444.82182294 hartree
oneelecener: -6132.95003570 hartree
twoeener: 2688.12821276 hartree
cpcmener: -0.03307519 hartree
kineticenergy: 1127.64671142 hartree
xcener: -110.660139186033 hartree
chargesum: 0.0000000
charge: -0.301984 -0.476173 -0.342767 -0.102501 0.116424 0.085037 -0.106743 -0.302371 -0.277790 -0.279813 -0.301020 0.388282 0.399768 0.037903 -0.214139 -0.157230 -0.236481 0.217756 -0.118309 -0.226838 0.266754 -0.245014 -0.162868 -0.114656 -0.184516 -0.184324 0.088436 0.100252 0.101152 0.095766 0.082550 0.099893 0.094224 0.100449 0.096372 0.092457 0.103008 0.096072 0.102318 0.145014 0.156237 0.151362 0.162725 0.150878 0.148669 0.159115 0.162268 0.171479 0.162918
qa: -0.3020 -0.4762 -0.3428 -0.1025 0.1164 0.0850 -0.1067 -0.3024 -0.2778 -0.2798 -0.3010 0.3883 0.3998 0.0379 -0.2141 -0.1572 -0.2365 0.2178 -0.1183 -0.2268 0.2668 -0.2450 -0.1629 -0.1147 -0.1845 -0.1843 0.0884 0.1003 0.1012 0.0958 0.0826 0.0999 0.0942 0.1004 0.0964 0.0925 0.1030 0.0961 0.1023 0.1450 0.1562 0.1514 0.1627 0.1509 0.1487 0.1591 0.1623 0.1715 0.1629
va: 2.1007 2.0225 2.0593 3.1129 3.6771 3.7704 3.9067 3.8965 3.9092 3.9014 3.9108 4.0765 3.7161 3.6345 4.0516 3.9134 3.9926 3.7784 3.8920 4.0089 3.6914 4.0116 3.8631 3.8714 3.8450 3.8486 1.0325 1.0132 0.9998 1.0062 1.0112 1.0003 1.0065 0.9989 1.0025 1.0054 0.9978 1.0128 0.9996 1.0240 1.0095 1.0003 0.9876 1.0038 1.0066 0.9973 0.9868 0.9823 0.9900
dispcorr: -0.026655479 hartree
energy: -1132.710349096932
dipole: 31.54208 -29.90830 1.63379 -3.98766 2.72983 -1.25782 -4.53554 3.78754 -0.74800
magnitude: 2.19337 au
magnitude: 5.57511 debye
