program: Orca
programVersion: 5.0.2
elementType: O O O N C C C C C C C C C C C C C C C C C C C C C C H H H H H H H H H H H H H H H H H H H H H H H
charge: 0
multiplicity: 1
keywords: wb97x-d3
keywords: def2-TZVPP
keywords: def2/J RIJCOSX
keywords: DEFGRID2
keywords: scfconv7
keywords: smallprint printgap noloewdin
keywords: NOSOSCF
formula: C22H23NO3
InChI: InChI=1/C22H23NO3/c1-21(2)19(22(21,3)4)20(24)26-18(14-23)15-9-8-12-17(13-15)25-16-10-6-5-7-11-16/h5-13,18-19H,1-4H3
49 atoms
O  0.989274 1.164717 0.296115
O  0.852598 3.190894 -0.653314
O  -2.380109 -3.072747 -0.609227
N  -0.449384 0.476175 3.196637
C  3.611458 2.473393 -1.951995
C  3.998048 3.046526 -0.62808
C  2.920551 1.96113 -0.688138
C  2.861458 3.301294 -2.970018
C  4.521303 1.475581 -2.635819
C  5.298946 2.632914 0.025203
C  3.644228 4.46815 -0.259474
C  1.511683 2.218209 -0.380182
C  -0.374666 1.239957 0.699233
C  -1.247461 0.386944 -0.187829
C  -0.408554 0.803826 2.095043
C  -1.397019 -0.97245 0.05397
C  -1.868807 0.981115 -1.280057
C  -2.203083 -1.726905 -0.787813
C  -2.645777 0.207797 -2.128752
C  -2.825775 -1.144234 -1.882529
C  -2.551315 -3.577977 0.658301
C  -1.983544 -4.815691 0.92462
C  -3.305191 -2.919478 1.622297
C  -2.170724 -5.397492 2.17062
C  -3.473444 -3.508844 2.86733
C  -2.908177 -4.745436 3.149163
H  3.252871 0.983368 -0.358427
H  2.260724 4.105205 -2.557194
H  3.579324 3.755497 -3.655801
H  2.202068 2.667965 -3.565684
H  3.962127 0.911011 -3.383909
H  5.332376 1.991217 -3.153626
H  4.965841 0.75414 -1.953032
H  6.1305 3.207185 -0.388218
H  5.261817 2.836944 1.096709
H  5.530675 1.576713 -0.095596
H  4.467977 5.126495 -0.541667
H  2.746439 4.855096 -0.730259
H  3.514896 4.557419 0.820569
H  -0.732957 2.272352 0.678808
H  -0.902211 -1.441937 0.89657
H  -1.749034 2.041066 -1.462035
H  -3.132168 0.664319 -2.980063
H  -3.448533 -1.745833 -2.532198
H  -1.404229 -5.319812 0.161583
H  -3.762073 -1.960823 1.411611
H  -1.7277 -6.363142 2.376099
H  -4.058256 -2.995378 3.619098
H  -3.045084 -5.197221 4.122449
elementType: O N C H
totalener: -1132.68398835 hartree
nucrepener: 2196.51356326 hartree
electener: -3329.19755161 hartree
oneelecener: -5902.20042987 hartree
twoeener: 2573.00287826 hartree
cpcmener: -0.03088526 hartree
kineticenergy: 1127.64350913 hartree
xcener: -110.656988861458 hartree
chargesum: 0.0000000
charge: -0.295418 -0.480790 -0.339478 -0.105364 0.109373 0.098030 -0.131670 -0.304424 -0.285660 -0.283505 -0.300944 0.417356 0.423340 0.004688 -0.212533 -0.190458 -0.173970 0.233798 -0.134319 -0.217771 0.283676 -0.251155 -0.186840 -0.124565 -0.150092 -0.189012 0.086353 0.097886 0.099082 0.102083 0.095831 0.099183 0.093324 0.100065 0.095502 0.092991 0.099599 0.096966 0.102184 0.130632 0.141606 0.148999 0.161854 0.150268 0.148931 0.158384 0.161547 0.162861 0.161576
qa: -0.2954 -0.4808 -0.3395 -0.1054 0.1094 0.0980 -0.1317 -0.3044 -0.2857 -0.2835 -0.3009 0.4174 0.4233 0.0047 -0.2125 -0.1905 -0.1740 0.2338 -0.1343 -0.2178 0.2837 -0.2512 -0.1868 -0.1246 -0.1501 -0.1890 0.0864 0.0979 0.0991 0.1021 0.0958 0.0992 0.0933 0.1001 0.0955 0.0930 0.0996 0.0970 0.1022 0.1306 0.1416 0.1490 0.1619 0.1503 0.1489 0.1584 0.1615 0.1629 0.1616
va: 2.1127 2.0207 2.0651 3.1039 3.6868 3.6994 3.9200 3.9094 3.9099 3.9080 3.9102 4.0843 3.7104 3.6773 4.0740 3.9876 3.9150 3.7800 3.9134 4.0097 3.6801 4.0037 3.8888 3.8806 3.8887 3.8989 1.0336 1.0110 0.9984 0.9989 1.0021 0.9988 1.0053 0.9988 1.0023 1.0052 0.9983 1.0126 0.9987 1.0300 1.0116 1.0108 0.9889 1.0037 1.0072 0.9964 0.9878 0.9891 0.9892
dispcorr: -0.023394055 hartree
energy: -1132.707382408905
dipole: 27.26521 -26.51217 0.75305 16.15860 -16.00790 0.15070 -11.34684 9.90262 -1.44422
magnitude: 1.63572 au
magnitude: 4.15766 debye
