program: Orca
programVersion: 5.0.2
elementType: O O O N C C C C C C C C C C C C C C C C C C C C C C H H H H H H H H H H H H H H H H H H H H H H H
charge: 0
multiplicity: 1
keywords: wb97x-d3
keywords: def2-TZVPP
keywords: def2/J RIJCOSX
keywords: DEFGRID2
keywords: scfconv7
keywords: smallprint printgap noloewdin
keywords: NOSOSCF
formula: C22H23NO3
InChI: InChI=1/C22H23NO3/c1-21(2)19(22(21,3)4)20(24)26-18(14-23)15-9-8-12-17(13-15)25-16-10-6-5-7-11-16/h5-13,18-19H,1-4H3
49 atoms
O  -0.025919 2.589048 0.165509
O  0.698653 0.634468 0.956848
O  -2.810398 -2.243528 -0.603707
N  -1.453518 1.741408 3.177857
C  3.548029 1.789719 0.26681
C  3.140448 1.02536 -0.949793
C  2.164105 2.034096 -0.340755
C  3.693517 1.104937 1.606189
C  4.517723 2.94426 0.141288
C  3.698997 1.407853 -2.303616
C  2.870668 -0.460836 -0.883858
C  0.923523 1.640121 0.327653
C  -1.343024 2.315037 0.628453
C  -2.057357 1.321985 -0.257684
C  -1.36822 1.95369 2.049913
C  -2.131616 -0.029483 0.049675
C  -2.604575 1.801077 -1.443659
C  -2.71473 -0.901596 -0.859535
C  -3.213773 0.92238 -2.324932
C  -3.259888 -0.435151 -2.045853
C  -1.743807 -2.900182 -0.036717
C  -2.03555 -3.892159 0.88788
C  -0.429692 -2.633224 -0.403319
C  -1.000487 -4.627538 1.448324
C  0.594684 -3.371585 0.171863
C  0.317279 -4.368412 1.098282
H  2.075412 2.963891 -0.891296
H  3.489551 1.809576 2.414459
H  3.049928 0.243745 1.752724
H  4.72419 0.764591 1.724739
H  4.423268 3.61139 1.000154
H  5.545803 2.575896 0.12284
H  4.36244 3.544436 -0.752674
H  3.77833 2.482695 -2.453074
H  4.692927 0.976911 -2.44141
H  3.058602 1.016751 -3.096312
H  2.108688 -0.741333 -1.614323
H  3.78434 -0.99864 -1.147169
H  2.55043 -0.826483 0.085906
H  -1.854182 3.278213 0.55976
H  -1.738239 -0.409355 0.983591
H  -2.559225 2.857735 -1.674708
H  -3.647494 1.293615 -3.243499
H  -3.719662 -1.126949 -2.739782
H  -3.063937 -4.088317 1.16344
H  -0.197253 -1.866978 -1.132401
H  -1.229735 -5.401486 2.16889
H  1.618017 -3.166494 -0.115051
H  1.121924 -4.939953 1.540943
elementType: O N C H
totalener: -1132.68293053 hartree
nucrepener: 2324.16092011 hartree
electener: -3456.84385063 hartree
oneelecener: -6158.20469603 hartree
twoeener: 2701.36084539 hartree
cpcmener: -0.03657657 hartree
kineticenergy: 1127.65217989 hartree
xcener: -110.662228006742 hartree
chargesum: 0.0000000
charge: -0.294651 -0.480773 -0.341951 -0.101399 0.097330 0.128011 -0.125733 -0.300766 -0.283214 -0.284621 -0.331094 0.428221 0.475993 -0.031188 -0.241293 -0.152651 -0.234351 0.232466 -0.116189 -0.230646 0.297544 -0.255059 -0.211887 -0.121111 -0.144807 -0.196907 0.087641 0.101953 0.097600 0.100424 0.095673 0.099647 0.092054 0.093524 0.100385 0.096001 0.106572 0.104423 0.087937 0.146278 0.140062 0.148025 0.162632 0.151239 0.148067 0.165378 0.160879 0.173385 0.160948
qa: -0.2947 -0.4808 -0.3420 -0.1014 0.0973 0.1280 -0.1257 -0.3008 -0.2832 -0.2846 -0.3311 0.4282 0.4760 -0.0312 -0.2413 -0.1527 -0.2344 0.2325 -0.1162 -0.2306 0.2975 -0.2551 -0.2119 -0.1211 -0.1448 -0.1969 0.0876 0.1020 0.0976 0.1004 0.0957 0.0996 0.0921 0.0935 0.1004 0.0960 0.1066 0.1044 0.0879 0.1463 0.1401 0.1480 0.1626 0.1512 0.1481 0.1654 0.1609 0.1734 0.1609
va: 2.1337 2.0072 2.0695 3.1057 3.7082 3.6767 3.9463 3.9108 3.9031 3.9055 3.9226 4.0446 3.8287 3.6309 4.0713 3.9002 3.9976 3.8063 3.8811 4.0203 3.6933 4.0079 3.8945 3.8800 3.8664 3.9294 1.0326 0.9991 1.0120 0.9982 1.0025 0.9987 1.0058 1.0057 0.9989 1.0019 0.9930 1.0011 0.9992 0.9923 1.0237 1.0021 0.9877 1.0035 1.0073 0.9897 0.9873 0.9826 0.9908
dispcorr: -0.026637308 hartree
energy: -1132.709567835642
dipole: 30.52579 -29.37968 1.14611 3.41634 -2.28559 1.13075 -7.70169 5.16367 -2.53802
magnitude: 3.00561 au
magnitude: 7.63965 debye
