program: Orca
programVersion: 5.0.2
elementType: O O O N C C C C C C C C C C C C C C C C C C C C C C H H H H H H H H H H H H H H H H H H H H H H H
charge: 0
multiplicity: 1
keywords: wb97x-d3
keywords: def2-TZVPP
keywords: def2/J RIJCOSX
keywords: DEFGRID2
keywords: scfconv7
keywords: smallprint printgap noloewdin
keywords: NOSOSCF
formula: C22H23NO3
InChI: InChI=1/C22H23NO3/c1-21(2)19(22(21,3)4)20(24)26-18(14-23)15-9-8-12-17(13-15)25-16-10-6-5-7-11-16/h5-13,18-19H,1-4H3
49 atoms
O  0.087222 1.989933 0.792112
O  0.692963 2.140878 -1.352109
O  -2.261134 -2.271258 -0.731533
N  -2.303984 3.266282 2.664726
C  2.840824 0.019961 -0.296192
C  3.568127 1.321062 -0.416872
C  2.229523 1.292928 0.305076
C  2.202923 -0.628332 -1.502614
C  3.288234 -1.019855 0.706461
C  4.766636 1.592006 0.468462
C  3.731776 2.0056 -1.755691
C  0.981563 1.851642 -0.217642
C  -1.208379 2.430203 0.443073
C  -2.083436 1.350253 -0.166314
C  -1.807817 2.889778 1.697862
C  -1.708146 0.014117 -0.127215
C  -3.287186 1.736265 -0.739659
C  -2.557332 -0.940194 -0.676587
C  -4.126513 0.769883 -1.27312
C  -3.770234 -0.567532 -1.243983
C  -1.225834 -2.798659 0.007119
C  -1.2216 -2.727505 1.393866
C  -0.220204 -3.463559 -0.677575
C  -0.18461 -3.324907 2.095581
C  0.804339 -4.069631 0.037506
C  0.828904 -3.997318 1.423317
H  2.292414 1.339642 1.386539
H  2.910507 -1.327165 -1.954783
H  1.32513 -1.20502 -1.203885
H  1.890421 0.062145 -2.280405
H  3.64677 -0.594969 1.641694
H  2.459196 -1.687386 0.950006
H  4.089327 -1.632789 0.287522
H  4.632568 1.259045 1.496138
H  5.655364 1.098498 0.069558
H  4.972835 2.663634 0.501322
H  4.696008 1.721389 -2.182443
H  2.971507 1.766009 -2.491844
H  3.741119 3.089908 -1.630723
H  -1.169126 3.293363 -0.230705
H  -0.771147 -0.284695 0.323644
H  -3.568506 2.781676 -0.768611
H  -5.068261 1.060598 -1.718901
H  -4.422427 -1.321593 -1.665607
H  -2.015925 -2.214619 1.922032
H  -0.240396 -3.509868 -1.759166
H  -0.174152 -3.266988 3.176034
H  1.589903 -4.589836 -0.495276
H  1.633207 -4.461923 1.977969
elementType: O N C H
totalener: -1132.68326467 hartree
nucrepener: 2338.97437007 hartree
electener: -3471.65763475 hartree
oneelecener: -6186.68973305 hartree
twoeener: 2715.03209830 hartree
cpcmener: -0.03337770 hartree
kineticenergy: 1127.63559698 hartree
xcener: -110.660405294364 hartree
chargesum: -0.0000000
charge: -0.295875 -0.466012 -0.333130 -0.100825 0.138370 0.108090 -0.109691 -0.303830 -0.280058 -0.290111 -0.305371 0.361433 0.404889 0.019443 -0.227623 -0.225177 -0.254922 0.344793 -0.096017 -0.264083 0.300311 -0.214570 -0.249020 -0.117784 -0.136426 -0.177663 0.089079 0.109873 0.073426 0.106848 0.097883 0.065039 0.103996 0.093080 0.100594 0.096851 0.097738 0.094553 0.103076 0.147957 0.133822 0.149214 0.161991 0.148863 0.158319 0.152853 0.163447 0.160791 0.161567
qa: -0.2959 -0.4660 -0.3331 -0.1008 0.1384 0.1081 -0.1097 -0.3038 -0.2801 -0.2901 -0.3054 0.3614 0.4049 0.0194 -0.2276 -0.2252 -0.2549 0.3448 -0.0960 -0.2641 0.3003 -0.2146 -0.2490 -0.1178 -0.1364 -0.1777 0.0891 0.1099 0.0734 0.1068 0.0979 0.0650 0.1040 0.0931 0.1006 0.0969 0.0977 0.0946 0.1031 0.1480 0.1338 0.1492 0.1620 0.1489 0.1583 0.1529 0.1634 0.1608 0.1616
va: 2.0965 2.0292 2.0838 3.1159 3.6464 3.7398 3.9060 3.8966 3.9059 3.9060 3.8983 4.1152 3.7112 3.6850 4.0706 3.9492 4.0065 3.6716 3.8809 4.0018 3.6222 3.9381 3.9571 3.8342 3.8148 3.8451 1.0339 1.0000 1.0129 1.0174 1.0095 1.0168 0.9989 1.0058 0.9984 1.0018 0.9983 1.0134 0.9988 1.0187 1.0172 1.0014 0.9873 1.0072 0.9967 1.0049 0.9873 0.9895 0.9903
dispcorr: -0.028099238 hartree
energy: -1132.711363912892
dipole: 29.27658 -27.62064 1.65594 -5.19158 4.04291 -1.14867 -4.72504 4.24738 -0.47766
magnitude: 2.07116 au
magnitude: 5.26448 debye
