program: Orca
programVersion: 5.0.2
elementType: O O O N C C C C C C C C C C C C C C C C C C C C C C H H H H H H H H H H H H H H H H H H H H H H H
charge: 0
multiplicity: 1
keywords: wb97x-d3
keywords: def2-TZVPP
keywords: def2/J RIJCOSX
keywords: DEFGRID2
keywords: scfconv7
keywords: smallprint printgap noloewdin
keywords: NOSOSCF
formula: C22H23NO3
InChI: InChI=1/C22H23NO3/c1-21(2)19(22(21,3)4)20(24)26-18(14-23)15-9-8-12-17(13-15)25-16-10-6-5-7-11-16/h5-13,18-19H,1-4H3
49 atoms
O  0.102315 1.934472 0.679635
O  0.706557 1.680532 -1.455533
O  -2.76422 -2.240439 0.351448
N  -2.199723 3.627164 2.321862
C  3.166196 0.084689 -0.35205
C  3.604588 1.491363 -0.100667
C  2.202515 1.048975 0.330635
C  2.925571 -0.410202 -1.760159
C  3.676041 -1.035691 0.529735
C  4.563031 1.801685 1.027744
C  3.781676 2.462571 -1.243756
C  0.978055 1.564002 -0.28609
C  -1.158239 2.412633 0.254075
C  -2.102087 1.31476 -0.189836
C  -1.724148 3.091223 1.422326
C  -1.950282 0.021842 0.288351
C  -3.155757 1.639431 -1.034031
C  -2.856808 -0.952992 -0.107575
C  -4.068297 0.660068 -1.393943
C  -3.920953 -0.642371 -0.940658
C  -1.524316 -2.834355 0.40929
C  -0.635398 -2.762326 -0.656342
C  -1.210792 -3.555975 1.550934
C  0.581221 -3.42246 -0.566015
C  0.008492 -4.216327 1.62453
C  0.910374 -4.148486 0.571965
H  2.101004 0.901186 1.399944
H  3.830206 -0.905402 -2.118133
H  2.125416 -1.152206 -1.773908
H  2.67356 0.359206 -2.482392
H  3.728808 -0.768698 1.583412
H  3.016687 -1.902364 0.450092
H  4.672161 -1.350824 0.212777
H  4.399213 1.193321 1.914741
H  5.594469 1.649038 0.703326
H  4.465098 2.846443 1.327702
H  3.640367 3.486049 -0.892067
H  4.801337 2.388753 -1.626679
H  3.109035 2.310794 -2.082525
H  -1.058533 3.162407 -0.538247
H  -1.141707 -0.23177 0.962517
H  -3.263816 2.651192 -1.404339
H  -4.89301 0.906866 -2.048569
H  -4.622799 -1.412496 -1.233102
H  -0.886504 -2.205877 -1.550769
H  -1.914377 -3.602017 2.372387
H  1.273409 -3.370877 -1.396174
H  0.254255 -4.779213 2.515325
H  1.861487 -4.659936 0.634238
elementType: O N C H
totalener: -1132.68386833 hartree
nucrepener: 2317.06752301 hartree
electener: -3449.75139134 hartree
oneelecener: -6142.95233610 hartree
twoeener: 2693.20094475 hartree
cpcmener: -0.03405158 hartree
kineticenergy: 1127.65090081 hartree
xcener: -110.660140237333 hartree
chargesum: 0.0000000
charge: -0.299427 -0.474669 -0.344229 -0.101455 0.111327 0.091805 -0.103944 -0.302367 -0.277917 -0.280005 -0.301368 0.383370 0.406926 0.011215 -0.220595 -0.139529 -0.214089 0.201485 -0.121528 -0.220207 0.266077 -0.162537 -0.243461 -0.188866 -0.118256 -0.180267 0.088544 0.101990 0.092222 0.100020 0.094181 0.082747 0.100704 0.092511 0.100227 0.096389 0.101950 0.103248 0.095945 0.148420 0.151489 0.149829 0.162410 0.151803 0.158634 0.149114 0.175916 0.161846 0.162373
qa: -0.2994 -0.4747 -0.3442 -0.1015 0.1113 0.0918 -0.1039 -0.3024 -0.2779 -0.2800 -0.3014 0.3834 0.4069 0.0112 -0.2206 -0.1395 -0.2141 0.2015 -0.1215 -0.2202 0.2661 -0.1625 -0.2435 -0.1889 -0.1183 -0.1803 0.0885 0.1020 0.0922 0.1000 0.0942 0.0827 0.1007 0.0925 0.1002 0.0964 0.1019 0.1032 0.0959 0.1484 0.1515 0.1498 0.1624 0.1518 0.1586 0.1491 0.1759 0.1618 0.1624
va: 2.1043 2.0236 2.0564 3.1128 3.6797 3.7635 3.9111 3.9008 3.9092 3.9016 3.9116 4.0835 3.7182 3.6301 4.0699 3.9040 3.9810 3.7830 3.8935 4.0035 3.6937 3.8623 4.0082 3.8514 3.8789 3.8586 1.0325 0.9990 1.0064 1.0137 1.0064 1.0108 0.9999 1.0052 0.9990 1.0025 0.9998 0.9977 1.0129 1.0180 1.0143 1.0006 0.9877 1.0030 0.9982 1.0065 0.9790 0.9871 0.9898
dispcorr: -0.026783756 hartree
energy: -1132.710652083306
dipole: 31.81968 -30.03612 1.78356 -3.64571 2.65211 -0.99360 -5.56470 4.70593 -0.85877
magnitude: 2.21491 au
magnitude: 5.62985 debye
