program: Orca
programVersion: 5.0.2
elementType: O O O N C C C C C C C C C C C C C C C C C C C C C C H H H H H H H H H H H H H H H H H H H H H H H
charge: 0
multiplicity: 1
keywords: wb97x-d3
keywords: def2-TZVPP
keywords: def2/J RIJCOSX
keywords: DEFGRID2
keywords: scfconv7
keywords: smallprint printgap noloewdin
keywords: NOSOSCF
formula: C22H23NO3
InChI: InChI=1/C22H23NO3/c1-21(2)19(22(21,3)4)20(24)26-18(14-23)15-9-8-12-17(13-15)25-16-10-6-5-7-11-16/h5-13,18-19H,1-4H3
49 atoms
O  0.340524 2.222351 -0.50746
O  1.801772 0.539276 -0.58288
O  -1.803295 -3.078428 1.150266
N  -2.768496 2.730451 -1.475328
C  3.706611 2.531872 0.938393
C  3.978348 2.824075 -0.500665
C  2.530224 2.767115 -0.012836
C  3.974564 1.162372 1.519085
C  3.914026 3.606323 1.983506
C  4.467602 4.195872 -0.911543
C  4.528797 1.760122 -1.421502
C  1.587678 1.711257 -0.390428
C  -0.691769 1.294405 -0.800725
C  -1.051699 0.425665 0.383301
C  -1.844123 2.112678 -1.181129
C  -1.253347 -0.931769 0.184404
C  -1.19318 0.989654 1.645803
C  -1.625334 -1.727373 1.261354
C  -1.538051 0.176795 2.714129
C  -1.764944 -1.1785 2.528346
C  -2.360169 -3.620101 0.017217
C  -1.836919 -4.827381 -0.423836
C  -3.441471 -3.034346 -0.630124
C  -2.401887 -5.453366 -1.525962
C  -3.986562 -3.665099 -1.739173
C  -3.47195 -4.872628 -2.193051
H  2.056149 3.736364 0.094321
H  3.903445 0.342809 0.811637
H  4.983703 1.143702 1.935468
H  3.283217 0.955087 2.337783
H  3.336064 3.373088 2.879369
H  4.965011 3.654156 2.274863
H  3.613462 4.598407 1.653726
H  4.261198 4.366694 -1.969455
H  4.002123 5.007372 -0.3560
H  5.54769 4.271334 -0.771483
H  4.232661 0.745381 -1.177376
H  4.219418 1.955338 -2.44999
H  5.619596 1.796682 -1.400046
H  -0.436466 0.6716 -1.663508
H  -1.117961 -1.357129 -0.802714
H  -1.037715 2.049608 1.800454
H  -1.646169 0.602743 3.702533
H  -2.045061 -1.809676 3.361798
H  -0.999172 -5.27508 0.096398
H  -3.862681 -2.101074 -0.278043
H  -1.994158 -6.396094 -1.866972
H  -4.826289 -3.208168 -2.246606
H  -3.904315 -5.358605 -3.057333
elementType: O N C H
totalener: -1132.68449627 hartree
nucrepener: 2213.55558993 hartree
electener: -3346.24008620 hartree
oneelecener: -5936.25907211 hartree
twoeener: 2590.01898590 hartree
cpcmener: -0.03366513 hartree
kineticenergy: 1127.64917632 hartree
xcener: -110.659155290355 hartree
chargesum: -0.0000000
charge: -0.294430 -0.476826 -0.336652 -0.102945 0.097366 0.105358 -0.110833 -0.301145 -0.283996 -0.281894 -0.302767 0.384643 0.424546 0.014916 -0.219918 -0.193845 -0.226912 0.272577 -0.131292 -0.227254 0.294564 -0.257578 -0.199394 -0.119994 -0.143052 -0.192429 0.088353 0.097446 0.100605 0.101366 0.095671 0.099745 0.093112 0.095437 0.092646 0.099772 0.097626 0.101150 0.099781 0.141042 0.148328 0.150105 0.162129 0.151465 0.149073 0.159095 0.161171 0.162798 0.161269
qa: -0.2944 -0.4768 -0.3367 -0.1029 0.0974 0.1054 -0.1108 -0.3011 -0.2840 -0.2819 -0.3028 0.3846 0.4245 0.0149 -0.2199 -0.1938 -0.2269 0.2726 -0.1313 -0.2273 0.2946 -0.2576 -0.1994 -0.1200 -0.1431 -0.1924 0.0884 0.0974 0.1006 0.1014 0.0957 0.0997 0.0931 0.0954 0.0926 0.0998 0.0976 0.1011 0.0998 0.1410 0.1483 0.1501 0.1621 0.1515 0.1491 0.1591 0.1612 0.1628 0.1613
va: 2.1168 2.0266 2.0701 3.1105 3.7036 3.7092 3.9161 3.9093 3.9064 3.9041 3.9069 4.0994 3.7082 3.5973 4.0820 3.9696 3.9630 3.7269 3.9129 4.0032 3.6727 4.0089 3.9100 3.8755 3.8823 3.9029 1.0326 1.0117 0.9986 0.9992 1.0023 0.9989 1.0052 1.0025 1.0052 0.9990 1.0129 0.9993 0.9980 1.0202 1.0052 1.0115 0.9884 1.0040 1.0074 0.9963 0.9880 0.9891 0.9896
dispcorr: -0.023696935 hartree
energy: -1132.708193203765
dipole: 30.04572 -28.55248 1.49324 12.80124 -12.70233 0.09891 2.68606 -2.18518 0.50088
magnitude: 1.57811 au
magnitude: 4.01124 debye
