program: Orca
programVersion: 5.0.2
elementType: O O O N C C C C C C C C C C C C C C C C C C C C C C H H H H H H H H H H H H H H H H H H H H H H H
charge: 0
multiplicity: 1
keywords: wb97x-d3
keywords: def2-TZVPP
keywords: def2/J RIJCOSX
keywords: DEFGRID2
keywords: scfconv7
keywords: smallprint printgap noloewdin
keywords: NOSOSCF
formula: C22H23NO3
InChI: InChI=1/C22H23NO3/c1-21(2)19(22(21,3)4)20(24)26-18(14-23)15-9-8-12-17(13-15)25-16-10-6-5-7-11-16/h5-13,18-19H,1-4H3
49 atoms
O  0.10237 2.525962 0.665128
O  1.222548 0.602249 0.551115
O  -2.89689 -2.368242 -0.952168
N  -0.80135 0.499206 3.237822
C  3.771793 2.343032 0.032489
C  3.126932 2.322419 -1.315112
C  2.286674 2.67214 -0.080689
C  4.247745 1.069172 0.692903
C  4.657658 3.508921 0.419365
C  3.362086 3.459004 -2.285005
C  2.892109 1.024721 -2.05167
C  1.213906 1.798965 0.395057
C  -1.075091 1.807575 0.98903
C  -1.57543 0.958932 -0.163157
C  -0.89583 1.05104 2.233262
C  -1.985546 -0.353181 0.019347
C  -1.641176 1.545761 -1.422726
C  -2.443286 -1.083928 -1.070784
C  -2.103626 0.803906 -2.498122
C  -2.499473 -0.514346 -2.333761
C  -2.357961 -3.20882 -0.006371
C  -3.241063 -3.970557 0.743333
C  -0.984527 -3.343834 0.15457
C  -2.742669 -4.88495 1.661543
C  -0.501211 -4.252304 1.084995
C  -1.373626 -5.025847 1.840134
H  2.045785 3.725575 0.007364
H  4.136263 1.135968 1.776383
H  3.745619 0.165153 0.364329
H  5.311978 0.941031 0.485291
H  4.793188 3.532145 1.502142
H  5.64595 3.404646 -0.032853
H  4.255284 4.476273 0.125162
H  2.555617 3.499163 -3.019374
H  3.414173 4.43476 -1.806662
H  4.294959 3.30381 -2.830885
H  2.008573 1.10775 -2.687533
H  3.743447 0.821509 -2.704247
H  2.757429 0.154513 -1.416766
H  -1.814342 2.582225 1.208584
H  -1.950182 -0.811252 0.99991
H  -1.333279 2.572174 -1.572578
H  -2.151868 1.255434 -3.479855
H  -2.854366 -1.094819 -3.175478
H  -4.308386 -3.853383 0.604764
H  -0.295555 -2.75332 -0.436595
H  -3.432068 -5.482301 2.24371
H  0.567975 -4.359599 1.212654
H  -0.987831 -5.734847 2.560265
elementType: O N C H
totalener: -1132.68295522 hartree
nucrepener: 2276.37795898 hartree
electener: -3409.06091420 hartree
oneelecener: -6062.78366859 hartree
twoeener: 2653.72275440 hartree
cpcmener: -0.03605811 hartree
kineticenergy: 1127.65111091 hartree
xcener: -110.662308823556 hartree
chargesum: -0.0000000
charge: -0.302071 -0.475848 -0.338251 -0.092903 0.108530 0.094587 -0.088748 -0.303833 -0.288324 -0.283492 -0.298130 0.386078 0.538369 -0.043370 -0.263399 -0.177014 -0.289817 0.279641 -0.102797 -0.245453 0.276729 -0.243958 -0.188279 -0.127527 -0.146469 -0.182820 0.087649 0.102682 0.095898 0.099033 0.095993 0.100343 0.093670 0.096191 0.093131 0.100118 0.097786 0.103464 0.099163 0.148093 0.134887 0.145563 0.161372 0.150223 0.148597 0.159405 0.161110 0.162834 0.161366
qa: -0.3021 -0.4758 -0.3383 -0.0929 0.1085 0.0946 -0.0887 -0.3038 -0.2883 -0.2835 -0.2981 0.3861 0.5384 -0.0434 -0.2634 -0.1770 -0.2898 0.2796 -0.1028 -0.2455 0.2767 -0.2440 -0.1883 -0.1275 -0.1465 -0.1828 0.0876 0.1027 0.0959 0.0990 0.0960 0.1003 0.0937 0.0962 0.0931 0.1001 0.0978 0.1035 0.0992 0.1481 0.1349 0.1456 0.1614 0.1502 0.1486 0.1594 0.1611 0.1628 0.1614
va: 2.1212 2.0194 2.0678 3.1031 3.7094 3.7144 3.9143 3.9064 3.9083 3.9038 3.9118 4.0622 3.7810 3.7280 4.1194 3.8751 3.9870 3.7728 3.8854 4.0152 3.6827 4.0074 3.9112 3.8777 3.8852 3.8971 1.0333 0.9988 1.0120 0.9982 1.0019 0.9982 1.0050 1.0022 1.0049 0.9991 1.0006 0.9991 1.0103 0.9882 1.0178 1.0112 0.9881 1.0053 1.0068 0.9975 0.9882 0.9891 0.9894
dispcorr: -0.025049624 hartree
energy: -1132.708004842605
dipole: 28.52438 -27.91634 0.60804 11.92284 -10.06648 1.85635 -9.66645 7.82681 -1.83964
magnitude: 2.68329 au
magnitude: 6.82038 debye
