program: Orca
programVersion: 5.0.2
elementType: O O O N C C C C C C C C C C C C C C C C C C C C C C H H H H H H H H H H H H H H H H H H H H H H H
charge: 0
multiplicity: 1
keywords: wb97x-d3
keywords: def2-TZVPP
keywords: def2/J RIJCOSX
keywords: DEFGRID2
keywords: scfconv7
keywords: smallprint printgap noloewdin
keywords: NOSOSCF
formula: C22H23NO3
InChI: InChI=1/C22H23NO3/c1-21(2)19(22(21,3)4)20(24)26-18(14-23)15-9-8-12-17(13-15)25-16-10-6-5-7-11-16/h5-13,18-19H,1-4H3
49 atoms
O  0.012518 2.335044 0.535502
O  0.846347 1.623158 -1.412981
O  -2.148591 -2.175891 0.908709
N  -2.344524 4.507837 1.284799
C  2.857924 0.192364 0.62165
C  3.599272 1.36773 0.072135
C  2.184774 1.572031 0.595163
C  2.364125 -0.908132 -0.287019
C  3.177203 -0.348664 1.996845
C  4.684111 2.021121 0.90184
C  3.922699 1.464619 -1.401473
C  1.006256 1.826334 -0.235603
C  -1.240983 2.564488 -0.072265
C  -2.144709 1.344317 -0.053995
C  -1.848756 3.652566 0.697356
C  -1.703295 0.124288 0.431789
C  -3.440604 1.472302 -0.545336
C  -2.565855 -0.965256 0.40853
C  -4.293481 0.382342 -0.53633
C  -3.859368 -0.849834 -0.06511
C  -1.114869 -2.820656 0.274125
C  -0.90591 -2.724553 -1.096292
C  -0.299315 -3.624237 1.060413
C  0.130296 -3.445361 -1.675171
C  0.728761 -4.341202 0.465906
C  0.950559 -4.255282 -0.902302
H  2.124046 2.047108 1.567925
H  3.135615 -1.675055 -0.379423
H  1.483691 -1.384132 0.148865
H  2.101981 -0.591056 -1.291804
H  2.315551 -0.888524 2.394289
H  4.009292 -1.053945 1.944856
H  3.437516 0.422867 2.718184
H  5.619287 1.46512 0.814093
H  4.869899 3.034992 0.543578
H  4.436877 2.093573 1.958982
H  3.232008 0.946644 -2.058548
H  3.957801 2.509385 -1.714936
H  4.914393 1.042251 -1.57493
H  -1.128029 2.920074 -1.102445
H  -0.710556 -0.006717 0.842764
H  -3.788513 2.42346 -0.929808
H  -5.302832 0.486749 -0.909726
H  -4.518394 -1.708102 -0.066334
H  -1.541754 -2.105192 -1.716125
H  -0.471638 -3.688939 2.127322
H  0.290361 -3.372267 -2.743005
H  1.36296 -4.96637 1.080659
H  1.75526 -4.813649 -1.361378
elementType: O N C H
totalener: -1132.68381904 hartree
nucrepener: 2328.64336615 hartree
electener: -3461.32718519 hartree
oneelecener: -6166.01803662 hartree
twoeener: 2704.69085143 hartree
cpcmener: -0.03310440 hartree
kineticenergy: 1127.64227834 hartree
xcener: -110.660497877951 hartree
chargesum: -0.0000000
charge: -0.290628 -0.466058 -0.344357 -0.102326 0.146227 0.115540 -0.127878 -0.296987 -0.287740 -0.285571 -0.304247 0.363565 0.409621 0.029463 -0.218912 -0.154977 -0.222056 0.200055 -0.124755 -0.199547 0.264574 -0.169363 -0.213052 -0.165677 -0.136099 -0.185929 0.089924 0.112223 0.035142 0.106610 0.095528 0.100954 0.095028 0.099782 0.095900 0.093474 0.096826 0.101772 0.098527 0.144352 0.157678 0.150299 0.163044 0.151196 0.152812 0.147196 0.161023 0.158292 0.159536
qa: -0.2906 -0.4661 -0.3444 -0.1023 0.1462 0.1155 -0.1279 -0.2970 -0.2877 -0.2856 -0.3042 0.3636 0.4096 0.0295 -0.2189 -0.1550 -0.2221 0.2001 -0.1248 -0.1995 0.2646 -0.1694 -0.2131 -0.1657 -0.1361 -0.1859 0.0899 0.1122 0.0351 0.1066 0.0955 0.1010 0.0950 0.0998 0.0959 0.0935 0.0968 0.1018 0.0985 0.1444 0.1577 0.1503 0.1630 0.1512 0.1528 0.1472 0.1610 0.1583 0.1595
va: 2.0991 2.0296 2.0505 3.1113 3.6926 3.7352 3.9416 3.9034 3.9018 3.9033 3.8994 4.1027 3.7034 3.6388 4.0532 3.9728 3.9898 3.7976 3.8842 3.9962 3.6743 3.8312 3.9369 3.8587 3.8719 3.8508 1.0335 0.9989 1.0227 1.0115 1.0011 0.9987 1.0062 0.9989 1.0022 1.0047 1.0118 0.9989 0.9984 1.0219 0.9971 1.0016 0.9882 1.0022 1.0009 1.0074 0.9907 0.9890 0.9905
dispcorr: -0.027938086 hartree
energy: -1132.711757123860
dipole: 29.31212 -27.97007 1.34205 -6.94873 5.57521 -1.37352 -1.36744 0.85084 -0.51660
magnitude: 1.98860 au
magnitude: 5.05462 debye
