program: Orca
programVersion: 5.0.2
elementType: O O O N C C C C C C C C C C C C C C C C C C C C C C H H H H H H H H H H H H H H H H H H H H H H H
charge: 0
multiplicity: 1
keywords: wb97x-d3
keywords: def2-TZVPP
keywords: def2/J RIJCOSX
keywords: DEFGRID2
keywords: scfconv7
keywords: smallprint printgap noloewdin
keywords: NOSOSCF
formula: C22H23NO3
InChI: InChI=1/C22H23NO3/c1-21(2)19(22(21,3)4)20(24)26-18(14-23)15-9-8-12-17(13-15)25-16-10-6-5-7-11-16/h5-13,18-19H,1-4H3
49 atoms
O  0.282111 1.501352 0.40466
O  1.001212 2.86835 -1.218978
O  -3.080683 -2.42666 0.118351
N  -1.782907 2.621507 2.756569
C  3.478201 0.959464 -1.376686
C  3.852557 1.882492 -0.262399
C  2.47269 1.222357 -0.256783
C  3.246002 1.478774 -2.777315
C  4.039992 -0.445528 -1.41562
C  4.798179 1.415844 0.823088
C  3.989764 3.369487 -0.491526
C  1.227041 1.968965 -0.447884
C  -1.029433 2.039802 0.322527
C  -1.972306 1.042858 -0.305169
C  -1.437356 2.350994 1.69308
C  -2.068041 -0.236043 0.232812
C  -2.721033 1.404064 -1.41495
C  -2.911407 -1.159427 -0.366102
C  -3.578242 0.474176 -1.989112
C  -3.671552 -0.80798 -1.476224
C  -2.032962 -3.073969 0.731167
C  -0.758447 -3.085665 0.17781
C  -2.309015 -3.769334 1.898493
C  0.249294 -3.791228 0.817976
C  -1.293486 -4.483174 2.520302
C  -0.011656 -4.491669 1.988913
H  2.372122 0.409563 0.453487
H  4.171208 1.38107 -3.348602
H  2.488261 0.87958 -3.28508
H  2.939362 2.517732 -2.839071
H  4.078843 -0.92582 -0.440054
H  3.424539 -1.075063 -2.061056
H  5.05049 -0.44212 -1.829046
H  5.834549 1.513269 0.493605
H  4.678852 2.033159 1.715258
H  4.638816 0.381916 1.122716
H  3.383805 3.76792 -1.298945
H  3.729171 3.91656 0.416333
H  5.031059 3.602395 -0.722362
H  -1.045664 2.975542 -0.242917
H  -1.492498 -0.502848 1.111584
H  -2.636948 2.400707 -1.82812
H  -4.167957 0.746958 -2.85376
H  -4.330907 -1.537311 -1.929102
H  -0.548665 -2.553325 -0.741467
H  -3.308457 -3.754763 2.314165
H  1.243555 -3.796686 0.391197
H  -1.508352 -5.028163 3.430059
H  0.778662 -5.042542 2.480776
elementType: O N C H
totalener: -1132.68385642 hartree
nucrepener: 2246.78504201 hartree
electener: -3379.46889843 hartree
oneelecener: -6002.28708632 hartree
twoeener: 2622.81818789 hartree
cpcmener: -0.03269477 hartree
kineticenergy: 1127.64739151 hartree
xcener: -110.657579129132 hartree
chargesum: 0.0000000
charge: -0.302571 -0.479689 -0.338035 -0.103747 0.107194 0.094983 -0.122186 -0.302525 -0.286308 -0.282927 -0.302685 0.405723 0.429957 0.019429 -0.220134 -0.203904 -0.198474 0.254024 -0.117675 -0.235547 0.282078 -0.191828 -0.248125 -0.143601 -0.125122 -0.187299 0.086472 0.098657 0.102459 0.096231 0.093078 0.095385 0.099571 0.100189 0.095759 0.093082 0.097387 0.102729 0.100234 0.128293 0.150524 0.151653 0.162334 0.150865 0.159241 0.148868 0.162806 0.161579 0.161603
qa: -0.3026 -0.4797 -0.3380 -0.1037 0.1072 0.0950 -0.1222 -0.3025 -0.2863 -0.2829 -0.3027 0.4057 0.4300 0.0194 -0.2201 -0.2039 -0.1985 0.2540 -0.1177 -0.2355 0.2821 -0.1918 -0.2481 -0.1436 -0.1251 -0.1873 0.0865 0.0987 0.1025 0.0962 0.0931 0.0954 0.0996 0.1002 0.0958 0.0931 0.0974 0.1027 0.1002 0.1283 0.1505 0.1517 0.1623 0.1509 0.1592 0.1489 0.1628 0.1616 0.1616
va: 2.1184 2.0239 2.0672 3.1088 3.6856 3.7123 3.9063 3.9088 3.9132 3.9076 3.9124 4.1028 3.6936 3.6907 4.0989 3.9422 3.9445 3.7708 3.8957 4.0043 3.6808 3.9114 4.0116 3.8779 3.8767 3.8997 1.0316 0.9982 0.9985 1.0118 1.0052 1.0021 0.9989 0.9989 1.0022 1.0051 1.0119 0.9986 0.9981 1.0366 1.0130 1.0002 0.9884 1.0044 0.9956 1.0066 0.9892 0.9879 0.9894
dispcorr: -0.023683942 hartree
energy: -1132.707540363808
dipole: 32.61106 -31.07489 1.53617 1.74537 -2.96393 -1.21857 -8.98617 7.67123 -1.31494
magnitude: 2.36089 au
magnitude: 6.00090 debye
