program: Orca
programVersion: 5.0.2
elementType: O O O N C C C C C C C C C C C C C C C C C C C C C C H H H H H H H H H H H H H H H H H H H H H H H
charge: 0
multiplicity: 1
keywords: wb97x-d3
keywords: def2-TZVPP
keywords: def2/J RIJCOSX
keywords: DEFGRID2
keywords: scfconv7
keywords: smallprint printgap noloewdin
keywords: NOSOSCF
formula: C22H23NO3
InChI: InChI=1/C22H23NO3/c1-21(2)19(22(21,3)4)20(24)26-18(14-23)15-9-8-12-17(13-15)25-16-10-6-5-7-11-16/h5-13,18-19H,1-4H3
49 atoms
O  0.394149 2.108083 -0.789828
O  1.802438 0.444741 -0.312197
O  -1.905707 -2.88815 1.375297
N  -2.487343 2.428641 -2.3637
C  3.488116 2.703495 1.100049
C  4.001449 2.697282 -0.30239
C  2.492161 2.74141 -0.060941
C  3.603472 1.479701 1.979288
C  3.561527 3.967761 1.928844
C  4.592261 3.957689 -0.89592
C  4.660899 1.469472 -0.886574
C  1.591779 1.631346 -0.378512
C  -0.594357 1.13905 -1.103943
C  -1.177762 0.47288 0.120618
C  -1.642548 1.877391 -1.811036
C  -1.258995 -0.909883 0.159305
C  -1.63297 1.24247 1.185445
C  -1.825024 -1.526066 1.268385
C  -2.170752 0.61043 2.295003
C  -2.278397 -0.772377 2.340271
C  -2.226469 -3.63064 0.262556
C  -3.248904 -3.2504 -0.59766
C  -1.524278 -4.808345 0.05651
C  -3.556948 -4.060459 -1.680637
C  -1.852047 -5.615114 -1.02473
C  -2.861466 -5.242292 -1.90102
H  2.041259 3.71273 -0.230026
H  2.775596 1.44554 2.689805
H  3.620843 0.532818 1.449498
H  4.525725 1.543676 2.560141
H  3.354775 4.872466 1.361041
H  2.836703 3.923742 2.74369
H  4.55212 4.072591 2.376035
H  4.578022 3.900673 -1.985765
H  4.057588 4.862198 -0.613351
H  5.633075 4.073371 -0.58681
H  4.496882 1.428478 -1.964804
H  5.738854 1.532855 -0.725455
H  4.326796 0.525864 -0.46769
H  -0.206072 0.38527 -1.796528
H  -0.883542 -1.495973 -0.670889
H  -1.573626 2.323086 1.153006
H  -2.526562 1.198453 3.130217
H  -2.711336 -1.263307 3.202303
H  -3.805644 -2.337196 -0.428475
H  -0.731171 -5.091811 0.736609
H  -4.352577 -3.765307 -2.351981
H  -1.303961 -6.534145 -1.185579
H  -3.108356 -5.870076 -2.746588
elementType: O N C H
totalener: -1132.68429415 hartree
nucrepener: 2217.56884072 hartree
electener: -3350.25313487 hartree
oneelecener: -5944.35739211 hartree
twoeener: 2594.10425724 hartree
cpcmener: -0.03359483 hartree
kineticenergy: 1127.65683141 hartree
xcener: -110.659693086555 hartree
chargesum: -0.0000000
charge: -0.293548 -0.478074 -0.341420 -0.103185 0.095834 0.102342 -0.110805 -0.300670 -0.283410 -0.284177 -0.301722 0.390798 0.422003 0.011613 -0.218653 -0.167125 -0.226635 0.243388 -0.133580 -0.219750 0.268954 -0.177530 -0.244284 -0.150342 -0.128201 -0.185033 0.088268 0.101538 0.097801 0.099566 0.092917 0.095646 0.099954 0.095522 0.093556 0.100018 0.102192 0.099361 0.097148 0.140498 0.149414 0.150709 0.163204 0.151447 0.159355 0.149467 0.162651 0.161356 0.161625
qa: -0.2935 -0.4781 -0.3414 -0.1032 0.0958 0.1023 -0.1108 -0.3007 -0.2834 -0.2842 -0.3017 0.3908 0.4220 0.0116 -0.2187 -0.1671 -0.2266 0.2434 -0.1336 -0.2198 0.2690 -0.1775 -0.2443 -0.1503 -0.1282 -0.1850 0.0883 0.1015 0.0978 0.0996 0.0929 0.0956 0.1000 0.0955 0.0936 0.1000 0.1022 0.0994 0.0971 0.1405 0.1494 0.1507 0.1632 0.1514 0.1594 0.1495 0.1627 0.1614 0.1616
va: 2.1224 2.0277 2.0612 3.1101 3.7035 3.7061 3.9176 3.9103 3.9069 3.9064 3.9068 4.0952 3.7164 3.5827 4.0801 3.9379 3.9666 3.7475 3.9136 4.0055 3.6920 3.8973 4.0032 3.8889 3.8803 3.8954 1.0327 0.9990 1.0118 0.9988 1.0055 1.0022 0.9988 1.0023 1.0052 0.9988 0.9989 0.9982 1.0125 1.0187 1.0059 1.0102 0.9879 1.0035 0.9956 1.0064 0.9891 0.9880 0.9891
dispcorr: -0.023750080 hartree
energy: -1132.708044228988
dipole: 29.19746 -27.82473 1.37274 13.31865 -13.13221 0.18644 5.19027 -4.51658 0.67369
magnitude: 1.54046 au
magnitude: 3.91554 debye
