program: Orca
programVersion: 5.0.2
elementType: O O O N C C C C C C C C C C C C C C C C C C C C C C H H H H H H H H H H H H H H H H H H H H H H H
charge: 0
multiplicity: 1
keywords: wb97x-d3
keywords: def2-TZVPP
keywords: def2/J RIJCOSX
keywords: DEFGRID2
keywords: scfconv7
keywords: smallprint printgap noloewdin
keywords: NOSOSCF
formula: C22H23NO3
InChI: InChI=1/C22H23NO3/c1-21(2)19(22(21,3)4)20(24)26-18(14-23)15-9-8-12-17(13-15)25-16-10-6-5-7-11-16/h5-13,18-19H,1-4H3
49 atoms
O  0.044948 2.409016 -0.142071
O  0.973125 0.59774 -1.066061
O  -2.808408 -2.422658 -0.038078
N  -2.407656 4.399295 -1.144037
C  3.072346 0.829957 1.230265
C  3.649616 1.7062 0.167367
C  2.184368 1.885545 0.565444
C  2.838367 -0.644102 0.988408
C  3.406189 1.086117 2.683913
C  4.563779 2.850402 0.55206
C  4.023036 1.153334 -1.188694
C  1.061164 1.5299 -0.304013
C  -1.1713 2.119725 -0.82747
C  -2.005241 1.145567 -0.034023
C  -1.847657 3.406392 -0.991829
C  -2.066084 -0.174843 -0.451598
C  -2.631316 1.541654 1.143214
C  -2.728293 -1.107208 0.335175
C  -3.320065 0.606031 1.8969
C  -3.360366 -0.72533 1.506549
C  -1.673001 -3.067829 -0.464837
C  -1.841752 -4.059545 -1.420625
C  -0.41488 -2.791578 0.057864
C  -0.74141 -4.785513 -1.852491
C  0.676949 -3.521402 -0.390619
C  0.522266 -4.518189 -1.344649
H  1.990599 2.759451 1.176903
H  3.702572 -1.204986 1.348816
H  1.971203 -0.987855 1.555294
H  2.684207 -0.921202 -0.048813
H  4.377226 0.652483 2.932031
H  3.435724 2.142045 2.944457
H  2.662507 0.614072 3.328453
H  5.58038 2.487132 0.7164
H  4.604286 3.585659 -0.253548
H  4.247831 3.374083 1.451882
H  3.458002 0.281874 -1.503055
H  3.901077 1.91999 -1.955917
H  5.077152 0.869051 -1.180407
H  -0.97954 1.729825 -1.831454
H  -1.591829 -0.474054 -1.377452
H  -2.589117 2.572389 1.47253
H  -3.81685 0.908789 2.808153
H  -3.880664 -1.460201 2.106921
H  -2.827329 -4.262966 -1.818959
H  -0.274155 -2.025348 0.809835
H  -0.875985 -5.558811 -2.597145
H  1.655963 -3.307727 0.018159
H  1.378549 -5.082472 -1.687832
elementType: O N C H
totalener: -1132.68410245 hartree
nucrepener: 2296.08158537 hartree
electener: -3428.76568782 hartree
oneelecener: -6101.09094382 hartree
twoeener: 2672.32525600 hartree
cpcmener: -0.03228021 hartree
kineticenergy: 1127.66632848 hartree
xcener: -110.661841329971 hartree
chargesum: -0.0000000
charge: -0.289799 -0.483362 -0.342378 -0.103980 0.125390 0.099642 -0.114440 -0.338368 -0.284526 -0.287682 -0.298871 0.403324 0.420879 -0.001122 -0.215872 -0.173951 -0.209816 0.258317 -0.133017 -0.218687 0.298589 -0.257319 -0.207497 -0.120334 -0.148455 -0.199956 0.088274 0.105633 0.106442 0.094165 0.100278 0.093756 0.096168 0.100167 0.095953 0.093796 0.096817 0.102036 0.098878 0.134916 0.148202 0.145441 0.163630 0.150825 0.148648 0.163240 0.160722 0.174062 0.161242
qa: -0.2898 -0.4834 -0.3424 -0.1040 0.1254 0.0996 -0.1144 -0.3384 -0.2845 -0.2877 -0.2989 0.4033 0.4209 -0.0011 -0.2159 -0.1740 -0.2098 0.2583 -0.1330 -0.2187 0.2986 -0.2573 -0.2075 -0.1203 -0.1485 -0.2000 0.0883 0.1056 0.1064 0.0942 0.1003 0.0938 0.0962 0.1002 0.0960 0.0938 0.0968 0.1020 0.0989 0.1349 0.1482 0.1454 0.1636 0.1508 0.1486 0.1632 0.1607 0.1741 0.1612
va: 2.1249 2.0106 2.0679 3.1094 3.6788 3.7020 3.9171 3.9211 3.9052 3.9056 3.9093 4.0878 3.7223 3.6244 4.0645 3.9280 3.9893 3.7350 3.9046 4.0274 3.6966 4.0023 3.8946 3.8840 3.8721 3.9328 1.0324 1.0008 0.9924 1.0001 0.9989 1.0056 1.0018 0.9986 1.0021 1.0048 1.0115 0.9988 0.9981 1.0205 1.0156 1.0079 0.9884 1.0033 1.0074 0.9910 0.9873 0.9828 0.9909
dispcorr: -0.026139782 hartree
energy: -1132.710242231722
dipole: 31.86940 -30.10403 1.76537 -1.46122 0.48610 -0.97513 8.19112 -7.02977 1.16135
magnitude: 2.32726 au
magnitude: 5.91543 debye
