program: Orca
programVersion: 5.0.2
elementType: O O O N C C C C C C C C C C C C C C C C C C C C C C H H H H H H H H H H H H H H H H H H H H H H H
charge: 0
multiplicity: 1
keywords: wb97x-d3
keywords: def2-TZVPP
keywords: def2/J RIJCOSX
keywords: DEFGRID2
keywords: scfconv7
keywords: smallprint printgap noloewdin
keywords: NOSOSCF
formula: C22H23NO3
InChI: InChI=1/C22H23NO3/c1-21(2)19(22(21,3)4)20(24)26-18(14-23)15-9-8-12-17(13-15)25-16-10-6-5-7-11-16/h5-13,18-19H,1-4H3
49 atoms
O  0.380482 1.617579 0.713303
O  0.754624 2.780027 -1.157205
O  -2.800677 -2.468385 -0.387558
N  -1.864227 1.918987 3.117984
C  3.341896 0.991377 -1.351697
C  3.792363 2.197598 -0.594395
C  2.517221 1.478818 -0.156112
C  2.809788 1.111124 -2.761013
C  4.043636 -0.334863 -1.155454
C  4.952922 2.088415 0.370987
C  3.739468 3.575731 -1.212916
C  1.173161 2.044337 -0.29686
C  -0.992094 1.991699 0.656001
C  -1.77788 1.053291 -0.227145
C  -1.46574 1.942405 2.039507
C  -1.914837 -0.279607 0.149636
C  -2.310107 1.512717 -1.421601
C  -2.58702 -1.154501 -0.690056
C  -2.989578 0.625822 -2.24684
C  -3.12424 -0.704645 -1.892538
C  -2.004383 -3.102498 0.540293
C  -0.628386 -3.181437 0.369207
C  -2.627451 -3.7134 1.61661
C  0.127257 -3.881126 1.298293
C  -1.86024 -4.422024 2.531939
C  -0.483436 -4.503357 2.380164
H  2.629842 0.872626 0.735533
H  3.634479 0.982094 -3.464901
H  2.08622 0.319031 -2.962051
H  2.333055 2.057774 -2.994058
H  3.391861 -1.152402 -1.469106
H  4.94625 -0.381878 -1.76823
H  4.33023 -0.528124 -0.123804
H  4.919302 2.906548 1.092805
H  4.960977 1.159006 0.93647
H  5.901501 2.162901 -0.16455
H  2.979583 3.709169 -1.976223
H  3.57106 4.330968 -0.44328
H  4.703674 3.795679 -1.67569
H  -1.11122 3.023553 0.313034
H  -1.507699 -0.622726 1.09347
H  -2.199328 2.550525 -1.706281
H  -3.410163 0.972729 -3.180932
H  -3.649344 -1.396561 -2.538551
H  -0.150244 -2.70698 -0.478764
H  -3.701338 -3.642292 1.733316
H  1.19973 -3.944687 1.169787
H  -2.344334 -4.904294 3.370863
H  0.111542 -5.050789 3.098899
elementType: O N C H
totalener: -1132.68446664 hartree
nucrepener: 2260.24434473 hartree
electener: -3392.92881136 hartree
oneelecener: -6029.52558886 hartree
twoeener: 2636.59677750 hartree
cpcmener: -0.03233201 hartree
kineticenergy: 1127.64893171 hartree
xcener: -110.657978504792 hartree
chargesum: -0.0000000
charge: -0.293059 -0.482412 -0.335333 -0.103162 0.098457 0.100977 -0.119191 -0.302099 -0.284389 -0.283333 -0.299766 0.401826 0.424603 -0.000076 -0.225682 -0.198136 -0.204370 0.269983 -0.111412 -0.244094 0.264847 -0.192210 -0.226694 -0.145805 -0.134256 -0.175131 0.088003 0.101424 0.101804 0.097500 0.095994 0.100088 0.093444 0.095939 0.092699 0.099377 0.096115 0.102303 0.098493 0.136254 0.142777 0.148081 0.161821 0.150287 0.161304 0.149658 0.163039 0.161340 0.162171
qa: -0.2931 -0.4824 -0.3353 -0.1032 0.0985 0.1010 -0.1192 -0.3021 -0.2844 -0.2833 -0.2998 0.4018 0.4246 -0.0001 -0.2257 -0.1981 -0.2044 0.2700 -0.1114 -0.2441 0.2648 -0.1922 -0.2267 -0.1458 -0.1343 -0.1751 0.0880 0.1014 0.1018 0.0975 0.0960 0.1001 0.0934 0.0959 0.0927 0.0994 0.0961 0.1023 0.0985 0.1363 0.1428 0.1481 0.1618 0.1503 0.1613 0.1497 0.1630 0.1613 0.1622
va: 2.1259 2.0187 2.0706 3.1101 3.7010 3.7063 3.9211 3.9096 3.9067 3.9067 3.9062 4.0949 3.7288 3.6415 4.0800 3.9556 3.9526 3.7599 3.9030 4.0034 3.6885 3.9321 4.0072 3.8808 3.8794 3.8920 1.0327 0.9982 0.9989 1.0122 1.0027 0.9989 1.0054 1.0023 1.0054 0.9989 1.0121 0.9986 0.9984 1.0192 1.0137 1.0090 0.9881 1.0053 0.9947 1.0053 0.9889 0.9884 0.9890
dispcorr: -0.024161941 hartree
energy: -1132.708628577595
dipole: 31.39169 -29.70128 1.69041 3.88382 -4.58273 -0.69891 -10.33390 9.18085 -1.15305
magnitude: 2.16229 au
magnitude: 5.49610 debye
