program: Orca
programVersion: 5.0.2
elementType: O O O N C C C C C C C C C C C C C C C C C C C C C C H H H H H H H H H H H H H H H H H H H H H H H
charge: 0
multiplicity: 1
keywords: wb97x-d3
keywords: def2-TZVPP
keywords: def2/J RIJCOSX
keywords: DEFGRID2
keywords: scfconv7
keywords: smallprint printgap noloewdin
keywords: NOSOSCF
formula: C22H23NO3
InChI: InChI=1/C22H23NO3/c1-21(2)19(22(21,3)4)20(24)26-18(14-23)15-9-8-12-17(13-15)25-16-10-6-5-7-11-16/h5-13,18-19H,1-4H3
49 atoms
O  0.458796 1.456878 0.551018
O  0.785404 2.781858 -1.220921
O  -3.008177 -2.558763 -0.327558
N  -1.645726 1.719712 3.078149
C  3.599603 1.45339 -1.450572
C  3.822696 2.433473 -0.344063
C  2.60507 1.50453 -0.295302
C  3.223931 1.920001 -2.838602
C  4.435509 0.192841 -1.520595
C  4.882429 2.168723 0.702414
C  3.643997 3.916412 -0.570021
C  1.232025 2.001535 -0.415695
C  -0.920132 1.816892 0.569502
C  -1.737407 0.883731 -0.289216
C  -1.311828 1.753812 1.97811
C  -1.9759 -0.419572 0.135841
C  -2.199849 1.321929 -1.521961
C  -2.680283 -1.283838 -0.689283
C  -2.905316 0.445315 -2.334924
C  -3.141814 -0.856502 -1.929563
C  -2.245997 -3.245357 0.589361
C  -2.910881 -3.861829 1.637962
C  -0.871802 -3.377972 0.437828
C  -2.18978 -4.627836 2.543917
C  -0.162184 -4.13518 1.358434
C  -0.815047 -4.762244 2.412332
H  2.698946 0.694687 0.419538
H  4.13263 2.017565 -3.43594
H  2.591546 1.180271 -3.332325
H  2.70905 2.873949 -2.880206
H  5.403991 0.401818 -1.979472
H  4.617486 -0.262782 -0.549391
H  3.933999 -0.553674 -2.139207
H  5.863479 2.480965 0.338558
H  4.669752 2.742065 1.606398
H  4.952201 1.122391 0.992355
H  4.594827 4.351133 -0.884625
H  2.904292 4.180904 -1.319282
H  3.355939 4.406555 0.3617
H  -1.065228 2.851008 0.24433
H  -1.627369 -0.750466 1.107179
H  -2.015831 2.337457 -1.845688
H  -3.268316 0.776995 -3.298218
H  -3.69048 -1.540757 -2.564136
H  -3.982907 -3.75076 1.738644
H  -0.357879 -2.902483 -0.38817
H  -2.708671 -5.114869 3.358919
H  0.908731 -4.239506 1.244786
H  -0.255369 -5.35487 3.123424
elementType: O N C H
totalener: -1132.68422769 hartree
nucrepener: 2234.38642134 hartree
electener: -3367.07064904 hartree
oneelecener: -5977.81708291 hartree
twoeener: 2610.74643387 hartree
cpcmener: -0.03177187 hartree
kineticenergy: 1127.64887862 hartree
xcener: -110.657900227608 hartree
chargesum: -0.0000000
charge: -0.290095 -0.485421 -0.334996 -0.104467 0.104376 0.094807 -0.122766 -0.302349 -0.286586 -0.281938 -0.301690 0.412584 0.419350 -0.004881 -0.220722 -0.189860 -0.193867 0.262761 -0.119150 -0.239191 0.275792 -0.240279 -0.195506 -0.127601 -0.141804 -0.182980 0.087534 0.097758 0.102102 0.097145 0.099684 0.093616 0.096403 0.100168 0.095283 0.092202 0.101656 0.097378 0.102463 0.135738 0.142014 0.147197 0.161660 0.150070 0.149276 0.160351 0.161514 0.163361 0.161902
qa: -0.2901 -0.4854 -0.3350 -0.1045 0.1044 0.0948 -0.1228 -0.3023 -0.2866 -0.2819 -0.3017 0.4126 0.4193 -0.0049 -0.2207 -0.1899 -0.1939 0.2628 -0.1191 -0.2392 0.2758 -0.2403 -0.1955 -0.1276 -0.1418 -0.1830 0.0875 0.0978 0.1021 0.0971 0.0997 0.0936 0.0964 0.1002 0.0953 0.0922 0.1017 0.0974 0.1025 0.1357 0.1420 0.1472 0.1617 0.1501 0.1493 0.1604 0.1615 0.1634 0.1619
va: 2.1237 2.0158 2.0696 3.1080 3.6908 3.7142 3.9166 3.9041 3.9085 3.9065 3.9136 4.0900 3.7206 3.6653 4.0767 3.9720 3.9422 3.7671 3.9099 4.0047 3.6815 4.0112 3.9279 3.8767 3.8789 3.8976 1.0325 0.9986 0.9993 1.0115 0.9986 1.0052 1.0019 0.9989 1.0026 1.0056 0.9981 1.0122 0.9991 1.0205 1.0113 1.0119 0.9885 1.0052 1.0064 0.9956 0.9882 0.9887 0.9893
dispcorr: -0.023625417 hartree
energy: -1132.707853109279
dipole: 32.21094 -30.58321 1.62773 7.37718 -7.94010 -0.56292 -9.14385 7.99130 -1.15255
magnitude: 2.07238 au
magnitude: 5.26757 debye
