program: Orca
programVersion: 5.0.2
elementType: O O O N C C C C C C C C C C C C C C C C C C C C C C H H H H H H H H H H H H H H H H H H H H H H H
charge: 0
multiplicity: 1
keywords: wb97x-d3
keywords: def2-TZVPP
keywords: def2/J RIJCOSX
keywords: DEFGRID2
keywords: scfconv7
keywords: smallprint printgap noloewdin
keywords: NOSOSCF
formula: C22H23NO3
InChI: InChI=1/C22H23NO3/c1-21(2)19(22(21,3)4)20(24)26-18(14-23)15-9-8-12-17(13-15)25-16-10-6-5-7-11-16/h5-13,18-19H,1-4H3
49 atoms
O  0.149429 1.983176 0.728983
O  0.665517 1.846294 -1.437308
O  -2.764138 -2.205288 0.20277
N  -2.236968 3.369795 2.5394
C  3.153692 0.19528 -0.465025
C  3.626574 1.609486 -0.371684
C  2.278752 1.228214 0.245105
C  2.730532 -0.400791 -1.788126
C  3.757348 -0.862641 0.433002
C  4.706371 1.984628 0.619646
C  3.693412 2.494491 -1.59443
C  0.999252 1.70041 -0.286745
C  -1.13919 2.438691 0.358072
C  -2.020487 1.351947 -0.216799
C  -1.735359 2.955591 1.590848
C  -1.944125 0.05812 0.279568
C  -2.925022 1.677054 -1.217414
C  -2.769805 -0.917723 -0.261358
C  -3.763619 0.696008 -1.724581
C  -3.683799 -0.606616 -1.258389
C  -1.5746 -2.84065 0.462117
C  -0.445758 -2.659692 -0.327923
C  -1.56265 -3.735458 1.522859
C  0.701558 -3.385624 -0.040199
C  -0.409678 -4.458575 1.792952
C  0.728375 -4.284285 1.017744
H  2.287424 1.156829 1.326804
H  2.38499 0.316848 -2.525138
H  3.5780 -0.932438 -2.225857
H  1.932284 -1.131054 -1.641015
H  3.960152 -0.51203 1.442873
H  3.079208 -1.714073 0.516377
H  4.695258 -1.229929 0.011417
H  4.67123 3.056261 0.823861
H  4.618417 1.471129 1.574746
H  5.693389 1.76223 0.208848
H  2.981986 2.252553 -2.377182
H  3.53406 3.537367 -1.314514
H  4.691641 2.425552 -2.031048
H  -1.077348 3.27568 -0.34572
H  -1.249919 -0.191394 1.072985
H  -2.972356 2.689033 -1.598925
H  -4.472355 0.941789 -2.503714
H  -4.32506 -1.378901 -1.663298
H  -0.452444 -1.970843 -1.163511
H  -2.450842 -3.868024 2.127461
H  1.579094 -3.249955 -0.65877
H  -0.40351 -5.156766 2.619638
H  1.627263 -4.846341 1.23239
elementType: O N C H
totalener: -1132.68405435 hartree
nucrepener: 2312.71517345 hartree
electener: -3445.39922780 hartree
oneelecener: -6134.16160890 hartree
twoeener: 2688.76238110 hartree
cpcmener: -0.03437831 hartree
kineticenergy: 1127.65798039 hartree
xcener: -110.662044777750 hartree
chargesum: -0.0000000
charge: -0.298657 -0.476131 -0.340230 -0.102366 0.112856 0.091401 -0.088041 -0.305467 -0.283053 -0.284669 -0.302743 0.375374 0.418932 0.014042 -0.219769 -0.183702 -0.205586 0.236420 -0.119917 -0.228716 0.296867 -0.185215 -0.263618 -0.165593 -0.115092 -0.197956 0.088550 0.102816 0.104273 0.086516 0.093418 0.089419 0.100680 0.095837 0.093551 0.100182 0.097078 0.102603 0.100109 0.146978 0.149427 0.148847 0.162570 0.151955 0.158672 0.148194 0.176878 0.161361 0.160717
qa: -0.2987 -0.4761 -0.3402 -0.1024 0.1129 0.0914 -0.0880 -0.3055 -0.2831 -0.2847 -0.3027 0.3754 0.4189 0.0140 -0.2198 -0.1837 -0.2056 0.2364 -0.1199 -0.2287 0.2969 -0.1852 -0.2636 -0.1656 -0.1151 -0.1980 0.0885 0.1028 0.1043 0.0865 0.0934 0.0894 0.1007 0.0958 0.0936 0.1002 0.0971 0.1026 0.1001 0.1470 0.1494 0.1488 0.1626 0.1520 0.1587 0.1482 0.1769 0.1614 0.1607
va: 2.1106 2.0209 2.0683 3.1120 3.6742 3.7352 3.8986 3.9086 3.9084 3.9056 3.9089 4.0903 3.7099 3.6043 4.0808 3.9412 3.9801 3.7548 3.8918 4.0084 3.6946 3.8775 4.0106 3.8622 3.8806 3.9232 1.0324 1.0150 0.9987 1.0053 1.0069 1.0084 0.9989 1.0023 1.0053 0.9987 1.0133 0.9987 0.9982 1.0171 1.0154 1.0014 0.9879 1.0031 0.9979 1.0078 0.9755 0.9872 0.9914
dispcorr: -0.026653531 hartree
energy: -1132.710707881386
dipole: 31.74130 -29.88089 1.86042 -3.09059 2.25879 -0.83179 -6.98991 6.01423 -0.97569
magnitude: 2.25942 au
magnitude: 5.74299 debye
