program: Orca
programVersion: 5.0.2
elementType: O O O N C C C C C C C C C C C C C C C C C C C C C C H H H H H H H H H H H H H H H H H H H H H H H
charge: 0
multiplicity: 1
keywords: wb97x-d3
keywords: def2-TZVPP
keywords: def2/J RIJCOSX
keywords: DEFGRID2
keywords: scfconv7
keywords: smallprint printgap noloewdin
keywords: NOSOSCF
formula: C22H23NO3
InChI: InChI=1/C22H23NO3/c1-21(2)19(22(21,3)4)20(24)26-18(14-23)15-9-8-12-17(13-15)25-16-10-6-5-7-11-16/h5-13,18-19H,1-4H3
49 atoms
O  0.087345 1.995471 0.797554
O  0.694752 2.17504 -1.343828
O  -2.232834 -2.264717 -0.749209
N  -2.304264 3.242823 2.681834
C  2.825942 0.02232 -0.31604
C  3.56237 1.31879 -0.430461
C  2.22838 1.29571 0.299463
C  2.175874 -0.61029 -1.523915
C  3.270723 -1.02901 0.675046
C  4.769968 1.571413 0.447406
C  3.724128 2.012458 -1.764112
C  0.981472 1.86619 -0.214331
C  -1.20854 2.435749 0.449627
C  -2.076643 1.355678 -0.169918
C  -1.811472 2.882196 1.707256
C  -1.694991 0.021486 -0.135484
C  -3.280019 1.738253 -0.74619
C  -2.537472 -0.935312 -0.69026
C  -4.112455 0.769513 -1.286036
C  -3.750128 -0.56649 -1.260104
C  -1.210872 -2.793214 0.006418
C  -0.209259 -3.481721 -0.660448
C  -1.214903 -2.702067 1.392076
C  0.80065 -4.0921 0.071054
C  -0.191257 -3.30297 2.109975
C  0.817088 -3.999402 1.455666
H  2.296324 1.332815 1.381023
H  2.878127 -1.304234 -1.990236
H  1.301098 -1.189691 -1.223807
H  1.857968 0.089482 -2.290565
H  4.058653 -1.650025 0.243461
H  3.645448 -0.614465 1.608325
H  2.436213 -1.687359 0.924013
H  5.650039 1.071315 0.038232
H  4.987465 2.640337 0.484923
H  4.641086 1.233332 1.473674
H  4.679895 1.717831 -2.202117
H  2.953917 1.792401 -2.495799
H  3.752205 3.095046 -1.628376
H  -1.171198 3.30457 -0.216733
H  -0.757825 -0.273381 0.317226
H  -3.566297 2.782374 -0.771873
H  -5.05387 1.057036 -1.734463
H  -4.397254 -1.322303 -1.686371
H  -0.222789 -3.543868 -1.741227
H  -2.005193 -2.170167 1.906847
H  1.581672 -4.631359 -0.44849
H  -0.187459 -3.228529 3.189385
H  1.610163 -4.467401 2.023346
elementType: O N C H
totalener: -1132.68328229 hartree
nucrepener: 2340.18764159 hartree
electener: -3472.87092388 hartree
oneelecener: -6189.10264621 hartree
twoeener: 2716.23172233 hartree
cpcmener: -0.03326770 hartree
kineticenergy: 1127.64811343 hartree
xcener: -110.662892642068 hartree
chargesum: -0.0000000
charge: -0.296282 -0.465213 -0.333232 -0.100831 0.138445 0.108305 -0.110613 -0.304184 -0.277869 -0.290118 -0.305656 0.361008 0.406437 0.020392 -0.228985 -0.226848 -0.254590 0.346173 -0.095823 -0.264846 0.305745 -0.256076 -0.216220 -0.131546 -0.117244 -0.179661 0.089430 0.109943 0.074299 0.106754 0.104154 0.098024 0.062515 0.100565 0.096697 0.093165 0.097719 0.094993 0.102929 0.147824 0.134273 0.149265 0.162008 0.148921 0.152170 0.158542 0.160610 0.163401 0.161126
qa: -0.2963 -0.4652 -0.3332 -0.1008 0.1384 0.1083 -0.1106 -0.3042 -0.2779 -0.2901 -0.3057 0.3610 0.4064 0.0204 -0.2290 -0.2268 -0.2546 0.3462 -0.0958 -0.2648 0.3057 -0.2561 -0.2162 -0.1315 -0.1172 -0.1797 0.0894 0.1099 0.0743 0.1068 0.1042 0.0980 0.0625 0.1006 0.0967 0.0932 0.0977 0.0950 0.1029 0.1478 0.1343 0.1493 0.1620 0.1489 0.1522 0.1585 0.1606 0.1634 0.1611
va: 2.0957 2.0299 2.0842 3.1158 3.6480 3.7403 3.9072 3.8984 3.9062 3.9057 3.8977 4.1162 3.7100 3.6855 4.0706 3.9487 4.0069 3.6681 3.8798 4.0023 3.6178 3.9591 3.9360 3.8131 3.8333 3.8486 1.0338 1.0000 1.0118 1.0171 0.9990 1.0096 1.0172 0.9984 1.0018 1.0059 0.9984 1.0133 0.9989 1.0189 1.0160 1.0014 0.9873 1.0071 1.0056 0.9966 0.9894 0.9874 0.9905
dispcorr: -0.028135440 hartree
energy: -1132.711417732217
dipole: 29.14015 -27.50558 1.63458 -5.25157 4.10699 -1.14459 -4.85139 4.35736 -0.49403
magnitude: 2.05572 au
magnitude: 5.22522 debye
