program: Orca
programVersion: 5.0.2
elementType: O O O N C C C C C C C C C C C C C C C C C C C C C C H H H H H H H H H H H H H H H H H H H H H H H
charge: 0
multiplicity: 1
keywords: wb97x-d3
keywords: def2-TZVPP
keywords: def2/J RIJCOSX
keywords: DEFGRID2
keywords: scfconv7
keywords: smallprint printgap noloewdin
keywords: NOSOSCF
formula: C22H23NO3
InChI: InChI=1/C22H23NO3/c1-21(2)19(22(21,3)4)20(24)26-18(14-23)15-9-8-12-17(13-15)25-16-10-6-5-7-11-16/h5-13,18-19H,1-4H3
49 atoms
O  0.280774 2.778908 -0.019943
O  1.232989 1.216451 -1.296038
O  -2.761378 -2.237039 -0.628731
N  -2.729068 4.052934 0.378792
C  3.774445 1.894502 0.465409
C  3.92103 2.748763 -0.751394
C  2.588106 2.740758 -0.007762
C  3.735782 0.388305 0.354859
C  4.391329 2.323816 1.777985
C  4.693334 4.048361 -0.673532
C  4.058715 2.13005 -2.123173
C  1.35856 2.141949 -0.531497
C  -0.988269 2.260443 -0.386295
C  -1.298994 0.9426 0.286338
C  -1.949875 3.275873 0.044997
C  -1.844688 -0.087433 -0.463268
C  -1.047413 0.772856 1.642661
C  -2.1629 -1.28962 0.154096
C  -1.358986 -0.43774 2.241214
C  -1.92325 -1.472964 1.509744
C  -2.52628 -3.572568 -0.405403
C  -1.245794 -4.067538 -0.1917
C  -3.617689 -4.426146 -0.470771
C  -1.068717 -5.434754 -0.036069
C  -3.423295 -5.792751 -0.326247
C  -2.151411 -6.302307 -0.103636
H  2.404488 3.621666 0.597051
H  3.311487 0.007344 -0.568021
H  4.75184 -0.003677 0.431258
H  3.162486 -0.036372 1.180762
H  3.875592 1.841653 2.610114
H  5.439331 2.021141 1.822327
H  4.347361 3.397362 1.948159
H  5.765584 3.86032 -0.756048
H  4.410792 4.701512 -1.50099
H  4.522097 4.602234 0.247253
H  3.656973 2.801964 -2.883636
H  5.118573 1.989379 -2.344509
H  3.572994 1.168002 -2.244594
H  -1.08151 2.164036 -1.472764
H  -2.02969 0.041405 -1.523315
H  -0.61878 1.572834 2.232618
H  -1.171985 -0.578082 3.29726
H  -2.175661 -2.404518 1.999443
H  -0.393024 -3.401395 -0.151055
H  -4.608795 -4.024609 -0.640892
H  -0.072533 -5.82255 0.131381
H  -4.274528 -6.458594 -0.382418
H  -2.003633 -7.367509 0.013055
elementType: O N C H
totalener: -1132.68419882 hartree
nucrepener: 2204.74779296 hartree
electener: -3337.43199177 hartree
oneelecener: -5918.59688801 hartree
twoeener: 2581.16489623 hartree
cpcmener: -0.03381325 hartree
kineticenergy: 1127.65724010 hartree
xcener: -110.660038028971 hartree
chargesum: -0.0000000
charge: -0.292581 -0.476372 -0.337701 -0.102292 0.097750 0.106873 -0.112317 -0.300752 -0.280879 -0.283040 -0.305019 0.383913 0.421204 0.017931 -0.221418 -0.236408 -0.224931 0.268209 -0.145528 -0.174610 0.278629 -0.189197 -0.246530 -0.149994 -0.128428 -0.182992 0.088729 0.098072 0.102138 0.099655 0.095431 0.099353 0.092976 0.099769 0.095327 0.093171 0.101848 0.098705 0.097455 0.142619 0.137920 0.151296 0.163389 0.161053 0.161505 0.149275 0.163531 0.161673 0.161589
qa: -0.2926 -0.4764 -0.3377 -0.1023 0.0978 0.1069 -0.1123 -0.3008 -0.2809 -0.2830 -0.3050 0.3839 0.4212 0.0179 -0.2214 -0.2364 -0.2249 0.2682 -0.1455 -0.1746 0.2786 -0.1892 -0.2465 -0.1500 -0.1284 -0.1830 0.0887 0.0981 0.1021 0.0997 0.0954 0.0994 0.0930 0.0998 0.0953 0.0932 0.1018 0.0987 0.0975 0.1426 0.1379 0.1513 0.1634 0.1611 0.1615 0.1493 0.1635 0.1617 0.1616
va: 2.1166 2.0259 2.0634 3.1112 3.7117 3.7055 3.9164 3.9118 3.9040 3.9050 3.9055 4.1027 3.7066 3.6070 4.0854 4.0790 3.9630 3.7545 3.9184 3.9076 3.6776 3.9109 4.0058 3.8871 3.8805 3.8955 1.0327 1.0119 0.9984 1.0000 1.0025 0.9990 1.0051 0.9987 1.0025 1.0052 0.9991 0.9982 1.0124 1.0182 1.0174 1.0115 0.9896 0.9939 0.9955 1.0067 0.9890 0.9880 0.9892
dispcorr: -0.023673812 hartree
energy: -1132.707872626969
dipole: 33.59428 -31.51094 2.08333 3.39233 -4.54132 -1.14899 1.86772 -1.21472 0.65301
magnitude: 2.46716 au
magnitude: 6.27102 debye
