program: Orca
programVersion: 5.0.2
elementType: O O O N C C C C C C C C C C C C C C C C C C C C C C H H H H H H H H H H H H H H H H H H H H H H H
charge: 0
multiplicity: 1
keywords: wb97x-d3
keywords: def2-TZVPP
keywords: def2/J RIJCOSX
keywords: DEFGRID2
keywords: scfconv7
keywords: smallprint printgap noloewdin
keywords: NOSOSCF
formula: C22H23NO3
InChI: InChI=1/C22H23NO3/c1-21(2)19(22(21,3)4)20(24)26-18(14-23)15-9-8-12-17(13-15)25-16-10-6-5-7-11-16/h5-13,18-19H,1-4H3
49 atoms
O  0.421003 1.234314 -0.457375
O  1.27241 3.195904 0.1714
O  -2.783299 -2.830288 -0.474491
N  -1.007721 1.895585 2.532657
C  3.701761 2.18535 -1.643549
C  4.082815 1.929874 -0.221491
C  2.711609 1.475792 -0.7129
C  3.411689 3.585216 -2.131523
C  4.286753 1.334555 -2.748988
C  5.044973 0.809219 0.111521
C  4.234919 3.068776 0.761626
C  1.454513 2.093081 -0.285159
C  -0.862948 1.701405 -0.074512
C  -1.90471 0.730679 -0.568787
C  -0.928846 1.823975 1.38694
C  -1.825958 -0.617626 -0.232114
C  -2.938803 1.207969 -1.359136
C  -2.803721 -1.484072 -0.698932
C  -3.908439 0.326794 -1.818348
C  -3.847528 -1.015027 -1.490604
C  -2.207851 -3.360215 0.655013
C  -1.404671 -4.478174 0.486352
C  -2.478271 -2.859553 1.922132
C  -0.870395 -5.107378 1.601815
C  -1.927604 -3.492407 3.027315
C  -1.125919 -4.616294 2.874464
H  2.619602 0.410422 -0.892601
H  2.727795 3.550073 -2.981605
H  2.974367 4.246325 -1.38933
H  4.336905 4.05009 -2.477015
H  4.393967 0.285904 -2.479621
H  3.652259 1.378808 -3.635856
H  5.272708 1.708901 -3.032171
H  4.877803 -0.094421 -0.471296
H  6.07603 1.128879 -0.052038
H  4.949344 0.537104 1.164188
H  5.289325 3.346659 0.815827
H  3.678834 3.967344 0.515122
H  3.932978 2.755196 1.762192
H  -1.064945 2.690628 -0.494514
H  -1.010779 -0.980693 0.382703
H  -2.987812 2.25812 -1.615553
H  -4.719433 0.689723 -2.435022
H  -4.600979 -1.705031 -1.848156
H  -1.208946 -4.857104 -0.508635
H  -3.115051 -1.993393 2.051794
H  -0.248906 -5.983388 1.470896
H  -2.137449 -3.106665 4.016164
H  -0.707668 -5.1081 3.742344
elementType: O N C H
totalener: -1132.68521384 hartree
nucrepener: 2207.50556048 hartree
electener: -3340.19077432 hartree
oneelecener: -5924.22878607 hartree
twoeener: 2584.03801175 hartree
cpcmener: -0.03470714 hartree
kineticenergy: 1127.64613006 hartree
xcener: -110.657407294807 hartree
chargesum: 0.0000000
charge: -0.296265 -0.478032 -0.334836 -0.106024 0.094361 0.105415 -0.110663 -0.299913 -0.280517 -0.286481 -0.302327 0.397638 0.449403 -0.003103 -0.235242 -0.214362 -0.188067 0.260676 -0.123146 -0.233692 0.296732 -0.253587 -0.206699 -0.122631 -0.140640 -0.187587 0.090066 0.101932 0.096285 0.102785 0.092831 0.095315 0.099985 0.093311 0.099311 0.096601 0.098212 0.096599 0.101814 0.126633 0.150038 0.149369 0.162397 0.150065 0.149491 0.159927 0.161721 0.163448 0.161451
qa: -0.2963 -0.4780 -0.3348 -0.1060 0.0944 0.1054 -0.1107 -0.2999 -0.2805 -0.2865 -0.3023 0.3976 0.4494 -0.0031 -0.2352 -0.2144 -0.1881 0.2607 -0.1231 -0.2337 0.2967 -0.2536 -0.2067 -0.1226 -0.1406 -0.1876 0.0901 0.1019 0.0963 0.1028 0.0928 0.0953 0.1000 0.0933 0.0993 0.0966 0.0982 0.0966 0.1018 0.1266 0.1500 0.1494 0.1624 0.1501 0.1495 0.1599 0.1617 0.1634 0.1615
va: 2.1556 2.0190 2.0734 3.1094 3.7238 3.6917 3.9280 3.9120 3.9041 3.9092 3.9038 4.0887 3.7045 3.7442 4.0250 3.9594 3.9340 3.7604 3.9090 3.9969 3.6621 4.0145 3.9268 3.8755 3.8789 3.9016 1.0285 0.9996 1.0125 0.9979 1.0053 1.0029 0.9985 1.0051 0.9986 1.0018 0.9985 1.0105 0.9999 1.0264 1.0155 1.0017 0.9887 1.0054 1.0069 0.9963 0.9880 0.9886 0.9893
dispcorr: -0.022990340 hartree
energy: -1132.708204177968
dipole: 30.89392 -30.16249 0.73143 8.37927 -9.24401 -0.86474 -7.92820 5.91235 -2.01584
magnitude: 2.31223 au
magnitude: 5.87722 debye
