program: Orca
programVersion: 5.0.2
elementType: O O O N C C C C C C C C C C C C C C C C C C C C C C H H H H H H H H H H H H H H H H H H H H H H H
charge: 0
multiplicity: 1
keywords: wb97x-d3
keywords: def2-TZVPP
keywords: def2/J RIJCOSX
keywords: DEFGRID2
keywords: scfconv7
keywords: smallprint printgap noloewdin
keywords: NOSOSCF
formula: C22H23NO3
InChI: InChI=1/C22H23NO3/c1-21(2)19(22(21,3)4)20(24)26-18(14-23)15-9-8-12-17(13-15)25-16-10-6-5-7-11-16/h5-13,18-19H,1-4H3
49 atoms
O  0.437542 2.30108 0.617183
O  0.874101 2.115633 -1.56321
O  -1.778723 -2.200066 1.33413
N  -2.056251 3.525882 2.403434
C  3.765656 1.294944 -0.764501
C  3.821862 2.757028 -0.454982
C  2.646851 1.918483 0.059635
C  3.536886 0.807225 -2.177842
C  4.657548 0.333356 -0.008292
C  4.769631 3.275527 0.603447
C  3.597894 3.787909 -1.536454
C  1.277722 2.111134 -0.426251
C  -0.936059 2.457847 0.297835
C  -1.617166 1.147663 -0.023736
C  -1.54332 3.058409 1.486455
C  -1.374899 0.033311 0.768314
C  -2.490556 1.073597 -1.09848
C  -2.023767 -1.158983 0.483515
C  -3.138873 -0.123839 -1.365175
C  -2.915259 -1.244268 -0.580663
C  -1.865671 -3.49698 0.88487
C  -2.573567 -4.396439 1.666908
C  -1.215173 -3.911543 -0.270305
C  -2.626412 -5.731211 1.288773
C  -1.285204 -5.246379 -0.641374
C  -1.988851 -6.159928 0.133159
H  2.690868 1.708075 1.122613
H  3.019637 1.505701 -2.827933
H  4.505164 0.596118 -2.636754
H  2.971796 -0.12676 -2.175776
H  5.669502 0.345907 -0.418267
H  4.725428 0.5495 1.056172
H  4.276051 -0.684694 -0.107494
H  5.759947 3.444704 0.175493
H  4.413727 4.230937 0.99306
H  4.883784 2.602576 1.450667
H  3.230065 4.717147 -1.096929
H  4.546354 4.013358 -2.028887
H  2.893522 3.492245 -2.308915
H  -1.077834 3.164431 -0.526812
H  -0.693132 0.082029 1.609222
H  -2.666342 1.942397 -1.719422
H  -3.828371 -0.189522 -2.196058
H  -3.436594 -2.167017 -0.799507
H  -3.072651 -4.056427 2.565388
H  -0.653859 -3.208224 -0.872793
H  -3.175225 -6.435024 1.900537
H  -0.779028 -5.57291 -1.540285
H  -2.035335 -7.199959 -0.160465
elementType: O N C H
totalener: -1132.68401610 hartree
nucrepener: 2208.01089200 hartree
electener: -3340.69490809 hartree
oneelecener: -5925.12520672 hartree
twoeener: 2584.43029863 hartree
cpcmener: -0.03375056 hartree
kineticenergy: 1127.64828635 hartree
xcener: -110.657687512181 hartree
chargesum: 0.0000000
charge: -0.295966 -0.475350 -0.336385 -0.103246 0.108865 0.095368 -0.113769 -0.304481 -0.289586 -0.280520 -0.298092 0.384987 0.424813 0.005179 -0.222201 -0.233384 -0.202686 0.251327 -0.138198 -0.180101 0.267789 -0.237534 -0.184300 -0.131824 -0.150901 -0.178644 0.089955 0.096122 0.097886 0.102961 0.099430 0.093882 0.096150 0.100159 0.095668 0.092266 0.101448 0.103550 0.095228 0.144135 0.137402 0.150856 0.163966 0.159653 0.149223 0.162111 0.161274 0.163336 0.162178
qa: -0.2960 -0.4753 -0.3364 -0.1032 0.1089 0.0954 -0.1138 -0.3045 -0.2896 -0.2805 -0.2981 0.3850 0.4248 0.0052 -0.2222 -0.2334 -0.2027 0.2513 -0.1382 -0.1801 0.2678 -0.2375 -0.1843 -0.1318 -0.1509 -0.1786 0.0900 0.0961 0.0979 0.1030 0.0994 0.0939 0.0961 0.1002 0.0957 0.0923 0.1014 0.1035 0.0952 0.1441 0.1374 0.1509 0.1640 0.1597 0.1492 0.1621 0.1613 0.1633 0.1622
va: 2.1134 2.0269 2.0645 3.1111 3.6856 3.7344 3.9068 3.9030 3.9113 3.9022 3.9120 4.1055 3.7007 3.6356 4.0834 4.0496 3.9751 3.7807 3.9078 3.8991 3.6849 4.0060 3.9149 3.8823 3.8850 3.8920 1.0308 1.0105 0.9985 0.9996 0.9984 1.0050 1.0019 0.9990 1.0026 1.0054 1.0000 0.9980 1.0129 1.0178 1.0273 1.0011 0.9897 0.9949 1.0063 0.9945 0.9883 0.9890 0.9890
dispcorr: -0.023391354 hartree
energy: -1132.707407452129
dipole: 30.04252 -28.77341 1.26911 2.72385 -3.95257 -1.22872 -10.43724 9.10037 -1.33687
magnitude: 2.21531 au
magnitude: 5.63088 debye
