program: Orca
programVersion: 5.0.2
elementType: O O O N C C C C C C C C C C C C C C C C C C C C C C H H H H H H H H H H H H H H H H H H H H H H H
charge: 0
multiplicity: 1
keywords: wb97x-d3
keywords: def2-TZVPP
keywords: def2/J RIJCOSX
keywords: DEFGRID2
keywords: scfconv7
keywords: smallprint printgap noloewdin
keywords: NOSOSCF
formula: C22H23NO3
InChI: InChI=1/C22H23NO3/c1-21(2)19(22(21,3)4)20(24)26-18(14-23)15-9-8-12-17(13-15)25-16-10-6-5-7-11-16/h5-13,18-19H,1-4H3
49 atoms
O  0.362145 1.828354 -0.022594
O  1.878088 1.157055 -1.52894
O  -3.429047 -2.567665 0.496052
N  -1.836136 3.298062 -2.065353
C  3.909387 1.76427 0.838047
C  3.863936 3.021781 0.033776
C  2.552702 2.356269 0.450354
C  4.388917 0.468468 0.227942
C  4.237949 1.820838 2.313959
C  4.14575 4.353016 0.696333
C  4.312504 3.036311 -1.40915
C  1.629344 1.715566 -0.489402
C  -0.706102 1.306629 -0.796888
C  -1.702916 0.642987 0.119862
C  -1.330458 2.425906 -1.510921
C  -2.073916 -0.669303 -0.132132
C  -2.239503 1.338166 1.19847
C  -2.982843 -1.293473 0.714704
C  -3.146548 0.702681 2.029993
C  -3.517966 -0.614191 1.798512
C  -2.574944 -3.517454 -0.013195
C  -3.074841 -4.360398 -0.994144
C  -1.283299 -3.675972 0.472836
C  -2.271807 -5.377616 -1.491086
C  -0.488451 -4.689668 -0.041795
C  -0.975892 -5.543178 -1.022872
H  2.040137 2.852828 1.266314
H  3.914535 -0.380089 0.724148
H  4.207112 0.368041 -0.837534
H  5.465534 0.375315 0.384291
H  3.865072 0.926822 2.816777
H  5.319172 1.85446 2.462227
H  3.805361 2.680589 2.82114
H  3.7105 4.445309 1.689197
H  5.221829 4.515214 0.785642
H  3.741056 5.165051 0.089556
H  4.198059 2.095169 -1.937087
H  3.766455 3.797396 -1.969219
H  5.370684 3.302942 -1.448664
H  -0.353474 0.592628 -1.545858
H  -1.65844 -1.192505 -0.984792
H  -1.958003 2.365951 1.390082
H  -3.566924 1.23267 2.87385
H  -4.223862 -1.110405 2.45195
H  -4.084286 -4.225457 -1.360888
H  -0.897635 -3.024396 1.246621
H  -2.663128 -6.037383 -2.254071
H  0.517745 -4.815113 0.335585
H  -0.350762 -6.333034 -1.417016
elementType: O N C H
totalener: -1132.68372561 hartree
nucrepener: 2193.73522485 hartree
electener: -3326.41895046 hartree
oneelecener: -5896.17588225 hartree
twoeener: 2569.75693179 hartree
cpcmener: -0.03325562 hartree
kineticenergy: 1127.65242832 hartree
xcener: -110.657832906426 hartree
chargesum: -0.0000000
charge: -0.295545 -0.479270 -0.339348 -0.103421 0.104750 0.107243 -0.145229 -0.300031 -0.282116 -0.283092 -0.305041 0.418503 0.431404 -0.006506 -0.224279 -0.151432 -0.233106 0.262550 -0.128756 -0.225578 0.277411 -0.247286 -0.187351 -0.126493 -0.147361 -0.186580 0.088114 0.101384 0.095476 0.100810 0.095840 0.099629 0.092507 0.092946 0.099300 0.095590 0.097377 0.101884 0.099135 0.122165 0.149916 0.152326 0.162736 0.151165 0.149358 0.160580 0.161802 0.163583 0.162341
qa: -0.2955 -0.4793 -0.3393 -0.1034 0.1047 0.1072 -0.1452 -0.3000 -0.2821 -0.2831 -0.3050 0.4185 0.4314 -0.0065 -0.2243 -0.1514 -0.2331 0.2625 -0.1288 -0.2256 0.2774 -0.2473 -0.1874 -0.1265 -0.1474 -0.1866 0.0881 0.1014 0.0955 0.1008 0.0958 0.0996 0.0925 0.0929 0.0993 0.0956 0.0974 0.1019 0.0991 0.1222 0.1499 0.1523 0.1627 0.1512 0.1494 0.1606 0.1618 0.1636 0.1623
va: 2.1354 2.0250 2.0648 3.1108 3.6980 3.6884 3.9275 3.9140 3.9069 3.9082 3.9068 4.0985 3.6788 3.7423 4.0789 3.9070 3.9836 3.7348 3.9149 4.0104 3.6828 4.0082 3.9087 3.8795 3.8863 3.8981 1.0302 0.9992 1.0120 0.9980 1.0025 0.9990 1.0052 1.0052 0.9988 1.0023 1.0119 0.9990 0.9983 1.0434 1.0027 1.0081 0.9883 1.0043 1.0067 0.9953 0.9880 0.9889 0.9891
dispcorr: -0.022822767 hartree
energy: -1132.706548377740
dipole: 33.23378 -31.80607 1.42771 8.58907 -9.58724 -0.99817 7.22402 -5.34840 1.87562
magnitude: 2.55981 au
magnitude: 6.50653 debye
