program: Orca
programVersion: 5.0.2
elementType: O O O N C C C C C C C C C C C C C C C C C C C C C C H H H H H H H H H H H H H H H H H H H H H H H
charge: 0
multiplicity: 1
keywords: wb97x-d3
keywords: def2-TZVPP
keywords: def2/J RIJCOSX
keywords: DEFGRID2
keywords: scfconv7
keywords: smallprint printgap noloewdin
keywords: NOSOSCF
formula: C22H23NO3
InChI: InChI=1/C22H23NO3/c1-21(2)19(22(21,3)4)20(24)26-18(14-23)15-9-8-12-17(13-15)25-16-10-6-5-7-11-16/h5-13,18-19H,1-4H3
49 atoms
O  0.173057 2.363843 -0.576009
O  1.158754 0.362912 -0.655282
O  -2.804445 -2.495216 0.803406
N  -2.672799 3.691742 -1.590008
C  3.347193 1.826108 1.111687
C  3.851318 1.912777 -0.292387
C  2.408898 2.315529 0.003859
C  3.117988 0.489438 1.778156
C  3.752246 2.871246 2.128254
C  4.765766 3.051117 -0.692935
C  4.171725 0.666934 -1.086759
C  1.242299 1.546961 -0.436622
C  -1.051805 1.745706 -0.94722
C  -1.641677 0.920221 0.172127
C  -1.946319 2.84997 -1.29627
C  -1.967647 -0.4048 -0.069594
C  -1.81906 1.479852 1.431719
C  -2.447708 -1.186334 0.972917
C  -2.318519 0.691686 2.456593
C  -2.623168 -0.643686 2.237926
C  -2.112409 -3.301255 -0.067945
C  -0.729547 -3.24781 -0.197254
C  -2.856872 -4.229089 -0.781745
C  -0.098989 -4.13186 -1.061252
C  -2.210305 -5.115122 -1.631592
C  -0.831246 -5.067082 -1.78053
H  2.232111 3.385167 0.015611
H  4.01707 0.20488 2.328626
H  2.304573 0.561902 2.502633
H  2.883401 -0.327237 1.102601
H  4.734302 2.63647 2.544011
H  3.795235 3.879356 1.721363
H  3.041326 2.88565 2.956316
H  5.793985 2.837514 -0.394334
H  4.758065 3.173607 -1.777479
H  4.484687 4.008163 -0.258206
H  5.232544 0.435435 -0.970801
H  3.615086 -0.218559 -0.798259
H  3.993515 0.837744 -2.149909
H  -0.928391 1.133284 -1.846229
H  -1.831519 -0.818365 -1.061181
H  -1.569249 2.517044 1.616856
H  -2.460225 1.114365 3.442062
H  -2.996486 -1.262132 3.043929
H  -0.142216 -2.529214 0.360499
H  -3.932952 -4.259808 -0.667351
H  0.976998 -4.087735 -1.166297
H  -2.792755 -5.840602 -2.183938
H  -0.330343 -5.754202 -2.449095
elementType: O N C H
totalener: -1132.68367970 hartree
nucrepener: 2257.58387399 hartree
electener: -3390.26755370 hartree
oneelecener: -6024.27088987 hartree
twoeener: 2634.00333617 hartree
cpcmener: -0.03274536 hartree
kineticenergy: 1127.65422965 hartree
xcener: -110.659813403712 hartree
chargesum: -0.0000000
charge: -0.289135 -0.479533 -0.337370 -0.102810 0.095712 0.105627 -0.109631 -0.298262 -0.283339 -0.286447 -0.303949 0.388814 0.415810 0.023966 -0.218563 -0.214309 -0.236578 0.296062 -0.122890 -0.234816 0.302203 -0.202097 -0.258885 -0.144891 -0.121227 -0.191698 0.088557 0.101909 0.101454 0.095974 0.100528 0.092731 0.095835 0.099831 0.095909 0.093765 0.098467 0.097568 0.102279 0.139322 0.149504 0.148996 0.162642 0.151428 0.157514 0.148039 0.162900 0.161415 0.161671
qa: -0.2891 -0.4795 -0.3374 -0.1028 0.0957 0.1056 -0.1096 -0.2983 -0.2833 -0.2864 -0.3039 0.3888 0.4158 0.0240 -0.2186 -0.2143 -0.2366 0.2961 -0.1229 -0.2348 0.3022 -0.2021 -0.2589 -0.1449 -0.1212 -0.1917 0.0886 0.1019 0.1015 0.0960 0.1005 0.0927 0.0958 0.0998 0.0959 0.0938 0.0985 0.0976 0.1023 0.1393 0.1495 0.1490 0.1626 0.1514 0.1575 0.1480 0.1629 0.1614 0.1617
va: 2.1246 2.0206 2.0750 3.1112 3.7140 3.6984 3.9155 3.9171 3.9061 3.9061 3.9042 4.0929 3.7319 3.5738 4.0780 3.9432 3.9749 3.7117 3.9026 4.0118 3.6693 3.9070 4.0100 3.8861 3.8753 3.9056 1.0322 0.9991 0.9993 1.0085 0.9988 1.0053 1.0022 0.9987 1.0022 1.0050 0.9982 1.0126 0.9990 1.0181 1.0044 1.0104 0.9881 1.0042 0.9993 1.0079 0.9895 0.9879 0.9893
dispcorr: -0.024561976 hartree
energy: -1132.708241678680
dipole: 32.79690 -30.76128 2.03562 4.23304 -4.75184 -0.51880 5.51374 -4.80556 0.70819
magnitude: 2.21685 au
magnitude: 5.63479 debye
