program: Gaussian 09
title: 000072265
version: EM64L-G09RevD.01
frameworkgroup: C1[X(C11H13N3O4)]
method: RPBEPBE
basis: SDD
operation: Freq
keyword: #p
keyword: freq=noraman
keyword: PBEPBE/SDD
title: #p freq=noraman PBEPBE/SDD
converged: YES YES NO NO
title: Mulliken charges:
elementType: O O O O N N N C C C C C C C C C C C H H H H H H H H H H H H H
charge: -0.290915 -0.428018 -0.254306 -0.234028 -0.170915 -0.405795 0.012439 -0.169156 -0.010779 -0.530906 -0.097631 -0.322015 -0.220116 -0.175761 0.220514 0.231594 0.099838 -0.761350 0.294862 0.271384 0.260686 0.285930 0.278322 0.175066 0.232461 0.265905 0.365474 0.362969 0.211535 0.252742 0.249974
chargesum: 0.00000
title: Mulliken charges with hydrogens summed into heavy atoms:
elementType: O O O O N N N C C C C C C C C C C C
charge: -0.290915 -0.065050 -0.254306 -0.234028 -0.170915 -0.040320 0.012439 0.102228 0.284083 0.015709 0.180691 0.085511 0.045789 -0.175761 0.220514 0.231594 0.099838 -0.047100
polarizability: 2.00094648e+02 1.81164139e+01 1.53442964e+02 1.93230886e+00 1.02740143e+01 9.39724318e+01
1716.lowfreq: -0.0002 0.0001 0.0002 0.9219 4.1732 7.7385 17.7064 29.3872 48.2185
frequency: 17.6882 29.2535 48.1921 60.8811 101.8021 103.6937 127.6972 141.4847 153.8936 173.8372 191.5412 259.2008 262.6721 275.5057 287.4356 357.1909 370.8145 380.4562 410.2594 447.5781 459.9564 469.6883 497.3293 535.4926 572.5829 599.6629 636.7969 697.4447 705.7578 717.6935 730.7505 754.0986 782.5260 810.1945 832.2066 859.1987 879.2935 910.9817 950.6528 972.2845 997.0946 1000.0095 1017.2757 1050.5064 1057.6575 1071.8474 1085.1203 1125.2962 1141.3040 1170.1586 1181.5755 1202.5217 1226.2283 1245.7676 1258.6765 1290.5837 1294.4022 1313.5659 1326.2807 1340.1728 1348.7663 1368.9224 1381.0075 1385.8101 1408.6219 1432.8883 1450.3346 1461.1144 1468.1603 1472.6141 1621.2009 1643.4421 1671.6347 2198.9293 2917.9818 2989.0398 3020.7058 3033.2668 3054.6977 3055.9727 3070.4702 3070.8038 3097.0698 3112.2508 3166.1478 3522.4741 3523.4506
redmass: 6.8553 6.0115 7.0968 8.2012 4.2424 3.4236 1.1983 4.7542 4.4741 6.3565 3.8517 4.9267 5.0072 3.8568 3.8571 4.9896 3.9822 9.9989 4.8006 3.2148 6.2132 1.3114 3.2997 4.3269 4.2062 6.1457 4.1690 2.8245 4.8331 4.0584 5.6132 6.2449 2.0737 3.8207 3.0204 3.2821 1.3890 3.3303 2.3795 2.9190 3.8189 2.3868 1.8562 1.4745 2.5318 3.6462 2.3799 2.7388 4.6614 1.3794 1.2544 1.4155 4.4321 1.2081 2.2116 1.2387 1.4329 1.4151 1.3407 1.9171 1.3724 1.6872 2.0033 1.3735 1.2659 2.0184 1.0430 1.0900 1.0899 1.0842 6.2996 8.9840 6.2639 12.5481 1.0704 1.0363 1.0773 1.0712 1.0856 1.0869 1.0931 1.0975 1.1007 1.1030 1.0928 1.0770 1.0654
irintensity: 0.9366 1.2272 3.5045 1.8535 3.3864 0.6669 1.8689 2.3749 4.1922 8.7578 2.2282 2.8765 10.7078 1.7478 2.8816 1.8884 7.3340 14.3356 0.6434 23.2144 7.5406 114.8204 1.7757 17.4020 9.2757 7.4254 5.6472 8.3900 5.3792 6.2716 6.7778 9.9929 105.7428 28.9793 13.1482 7.3249 14.3450 82.2590 13.6779 61.7257 136.4208 21.2288 10.6685 6.2724 78.1942 8.5862 5.0121 53.7327 15.8199 6.3676 35.9505 38.9050 9.9490 9.0464 158.3050 7.6862 28.3833 64.1361 24.8149 69.0810 5.8798 36.7075 42.3951 22.2323 16.4817 63.7273 12.1606 6.2389 16.3645 4.7930 208.2798 266.8205 537.6910 10.7932 76.6079 17.9946 3.3732 10.7296 4.0153 5.2538 45.5481 10.9420 13.3740 6.0547 5.4266 66.1020 11.3628
temp: 298.150 k
press: 1.00000 atm
elementType: 8 8 8 8 7 7 7 6 6 6 6 6 6 6 6 6 6 6 1 1 1 1 1 1 1 1 1 1 1 1 1
symmnumber: 1
zpe: 621576.6 jmol-1
zpe.correction: 0.236746 hartree
zpe.thermalcorrener: 0.253953 hartree
zpe.thermalcorrenthalpy: 0.254897 hartree
zpe.thermalcorrgfe: 0.189736 hartree
zpe.sumelectzpe: -890.780650 hartree
zpe.sumelectthermal: -890.763443 hartree
zpe.sumelectthermalent: -890.762499 hartree
zpe.sumelectthermalfe: -890.827659 hartree
dipole: -0.9892 3.2362 3.8715
dipole: 5.1420
quadrupole: -133.1483 -122.2813 -103.2499
quadrupole: -8.1677 -7.1844 2.7347
quadrupole: -13.5884 -2.7215 16.3099 -8.1677 -7.1844 2.7347
hfenergy: -891.0173957 hartree
pointgroup: C01 [X(C11H13N3O4)]
dipole: -0.3073885 -1.2572666 -1.5548056 debye
polarizability: 201.2291545|-16.8974458|151.9848551|0.366772|10.7886333|94.2960336 unknown
InChI: InChI=1S/C11H13N3O4/c1-6-4-14(11(17)13-10(6)16)9-2-7(3-12)8(5-15)18-9/h4,7-9,13,15H,2,5H2,1H3
charge 0 multiplicity 1
31 atoms
O  -1.30823 -0.467204 0.955727
O  -1.932795 -3.190666 1.062284
O  0.998085 2.72783 0.88657
O  4.826077 0.159535 0.113398
N  0.723837 0.50812 0.12521
N  2.880689 1.392497 0.490196
N  -4.568203 1.97093 -0.285406
C  -2.850557 0.019147 -0.879675
C  -0.739003 0.648627 0.159544
C  -1.430387 0.563419 -1.220491
C  -2.588118 -0.927541 0.340142
C  -2.402219 -2.399364 -0.067448
C  1.317194 -0.702978 -0.254667
C  -3.797756 1.099241 -0.548601
C  1.501251 1.627159 0.535227
C  2.674161 -0.908196 -0.287667
C  3.563248 0.20124 0.101458
C  3.310682 -2.215909 -0.686154
H  -0.942837 1.608555 0.664537
H  -3.267974 -0.552701 -1.729654
H  -0.903623 -0.152608 -1.875069
H  -1.456323 1.543457 -1.720378
H  -3.365868 -0.842326 1.117823
H  -1.69969 -2.467388 -0.93021
H  -3.368771 -2.841552 -0.364998
H  0.613767 -1.502363 -0.501794
H  3.469953 2.182499 0.773381
H  -1.202936 -2.682154 1.505736
H  2.552447 -2.971442 -0.95383
H  3.93105 -2.613782 0.137137
H  3.99095 -2.073678 -1.545128
