program: Orca
programVersion: 5.0.2
elementType: O O O N C C C C C C C C C C C C C C C C C C C C C C H H H H H H H H H H H H H H H H H H H H H H H
charge: 0
multiplicity: 1
keywords: wb97x-d3
keywords: def2-TZVPP
keywords: def2/J RIJCOSX
keywords: DEFGRID2
keywords: scfconv7
keywords: smallprint printgap noloewdin
keywords: NOSOSCF
formula: C22H23NO3
InChI: InChI=1/C22H23NO3/c1-21(2)19(22(21,3)4)20(24)26-18(14-23)15-9-8-12-17(13-15)25-16-10-6-5-7-11-16/h5-13,18-19H,1-4H3
49 atoms
O  0.572896 1.561955 -0.389689
O  1.190894 3.632086 -0.929328
O  -2.126913 -2.191029 1.588248
N  -1.600638 3.625746 1.199427
C  3.971694 2.102859 -1.390034
C  4.084355 2.824473 -0.086188
C  2.847844 1.975064 -0.354999
C  3.735876 2.859247 -2.676175
C  4.775506 0.846281 -1.637681
C  5.008599 2.29148 0.988371
C  4.015158 4.333722 -0.025319
C  1.508159 2.516397 -0.593723
C  -0.777344 1.927454 -0.616441
C  -1.630179 0.685522 -0.55814
C  -1.217197 2.888152 0.403875
C  -1.482099 -0.220559 0.486037
C  -2.567211 0.464392 -1.556492
C  -2.282094 -1.351195 0.518793
C  -3.367567 -0.668723 -1.503348
C  -3.23252 -1.581544 -0.471228
C  -2.237233 -3.548449 1.389967
C  -1.557813 -4.185976 0.359247
C  -3.009862 -4.268958 2.287067
C  -1.664729 -5.562791 0.23049
C  -3.099526 -5.648067 2.152118
C  -2.435126 -6.298798 1.121963
H  2.830834 1.019356 0.157209
H  3.227433 2.219971 -3.400275
H  3.146632 3.765546 -2.571901
H  4.695793 3.143537 -3.111549
H  4.301096 0.242183 -2.412947
H  5.778891 1.099073 -1.98641
H  4.878019 0.218482 -0.755145
H  6.040731 2.581079 0.781277
H  4.737944 2.714327 1.95759
H  4.979141 1.208467 1.090038
H  3.453033 4.801412 -0.826594
H  3.578143 4.659002 0.920261
H  5.030136 4.734345 -0.067285
H  -0.899208 2.408177 -1.591666
H  -0.755701 -0.057934 1.273172
H  -2.674171 1.170293 -2.36987
H  -4.105325 -0.843906 -2.274465
H  -3.866119 -2.458519 -0.439758
H  -0.947257 -3.620902 -0.334023
H  -3.532677 -3.757026 3.084795
H  -1.136863 -6.06198 -0.571433
H  -3.701541 -6.211874 2.85245
H  -2.513394 -7.372488 1.016015
elementType: O N C H
totalener: -1132.68514102 hartree
nucrepener: 2169.59116159 hartree
electener: -3302.27630261 hartree
oneelecener: -5848.19788173 hartree
twoeener: 2545.92157912 hartree
cpcmener: -0.03616108 hartree
kineticenergy: 1127.65361183 hartree
xcener: -110.658677086127 hartree
chargesum: 0.0000000
charge: -0.292561 -0.478642 -0.340094 -0.105473 0.096866 0.104088 -0.116739 -0.298928 -0.281421 -0.284853 -0.303908 0.403620 0.434539 -0.006425 -0.233794 -0.218837 -0.178117 0.209997 -0.149517 -0.152781 0.248170 -0.166692 -0.230235 -0.156533 -0.135292 -0.175292 0.091001 0.102203 0.095847 0.103369 0.096452 0.100128 0.092550 0.099485 0.095852 0.093535 0.095880 0.102282 0.098035 0.131249 0.139479 0.150260 0.163589 0.160608 0.161545 0.149524 0.162757 0.161282 0.161942
qa: -0.2926 -0.4786 -0.3401 -0.1055 0.0969 0.1041 -0.1167 -0.2989 -0.2814 -0.2849 -0.3039 0.4036 0.4345 -0.0064 -0.2338 -0.2188 -0.1781 0.2100 -0.1495 -0.1528 0.2482 -0.1667 -0.2302 -0.1565 -0.1353 -0.1753 0.0910 0.1022 0.0958 0.1034 0.0965 0.1001 0.0925 0.0995 0.0959 0.0935 0.0959 0.1023 0.0980 0.1312 0.1395 0.1503 0.1636 0.1606 0.1615 0.1495 0.1628 0.1613 0.1619
va: 2.1520 2.0192 2.0535 3.1109 3.7265 3.6975 3.9355 3.9122 3.9040 3.9080 3.9032 4.0838 3.7082 3.7532 4.0207 4.0710 3.9427 3.8131 3.9162 3.8883 3.7004 3.8963 3.9959 3.8913 3.8854 3.8869 1.0274 0.9998 1.0119 0.9980 1.0026 0.9990 1.0053 0.9985 1.0022 1.0051 1.0114 0.9994 0.9985 1.0229 1.0271 1.0013 0.9903 0.9938 0.9942 1.0059 0.9894 0.9883 0.9889
dispcorr: -0.022739541 hartree
energy: -1132.707880561883
dipole: 30.69200 -29.68499 1.00702 4.51706 -7.15268 -2.63561 -8.54756 6.83734 -1.71022
magnitude: 3.29930 au
magnitude: 8.38616 debye
