program: Orca
programVersion: 5.0.2
elementType: O O O N C C C C C C C C C C C C C C C C C C C C C C H H H H H H H H H H H H H H H H H H H H H H H
charge: 0
multiplicity: 1
keywords: wb97x-d3
keywords: def2-TZVPP
keywords: def2/J RIJCOSX
keywords: DEFGRID2
keywords: scfconv7
keywords: smallprint printgap noloewdin
keywords: NOSOSCF
formula: C22H23NO3
InChI: InChI=1/C22H23NO3/c1-21(2)19(22(21,3)4)20(24)26-18(14-23)15-9-8-12-17(13-15)25-16-10-6-5-7-11-16/h5-13,18-19H,1-4H3
49 atoms
O  0.595056 1.607783 -0.272338
O  1.189306 3.648124 -0.946396
O  -2.002068 -2.279567 1.564701
N  -1.588867 3.594544 1.383695
C  3.965815 2.050493 -1.344484
C  4.101343 2.9294 -0.141486
C  2.867208 2.048874 -0.275899
C  3.687643 2.637671 -2.708486
C  4.783955 0.782708 -1.452299
C  5.053073 2.537104 0.969482
C  4.026582 4.435079 -0.268048
C  1.518857 2.558383 -0.54572
C  -0.764478 1.952284 -0.482017
C  -1.597525 0.695499 -0.458661
C  -1.205962 2.876441 0.570185
C  -1.419752 -0.250384 0.543766
C  -2.545947 0.501458 -1.452699
C  -2.198485 -1.39771 0.538086
C  -3.325894 -0.646187 -1.436352
C  -3.159505 -1.601318 -0.44752
C  -2.203984 -3.622467 1.333822
C  -1.554109 -4.274671 0.293831
C  -3.036756 -4.312266 2.200288
C  -1.753206 -5.636415 0.122482
C  -3.218768 -5.677593 2.023521
C  -2.585135 -6.342091 0.982767
H  2.862234 1.161693 0.348325
H  3.060888 3.525043 -2.704679
H  4.628754 2.905126 -3.192828
H  3.196606 1.895319 -3.340585
H  5.776508 1.00676 -1.848911
H  4.914696 0.267249 -0.503168
H  4.308016 0.081923 -2.140497
H  4.798648 3.074759 1.884882
H  5.034682 1.474781 1.204485
H  6.078434 2.804974 0.70689
H  3.474214 4.797349 -1.128612
H  3.57873 4.874717 0.624638
H  5.04106 4.830736 -0.347523
H  -0.903135 2.460647 -1.440542
H  -0.685365 -0.108294 1.327439
H  -2.676587 1.238826 -2.234044
H  -4.072008 -0.801681 -2.203712
H  -3.776713 -2.49031 -0.44798
H  -0.897916 -3.730281 -0.373951
H  -3.534262 -3.787354 3.005726
H  -1.250395 -6.147912 -0.687723
H  -3.867895 -6.218743 2.699217
H  -2.735655 -7.404172 0.842999
elementType: O N C H
totalener: -1132.68485228 hartree
nucrepener: 2167.44700108 hartree
electener: -3300.13185335 hartree
oneelecener: -5843.89759437 hartree
twoeener: 2543.76574102 hartree
cpcmener: -0.03543251 hartree
kineticenergy: 1127.64176212 hartree
xcener: -110.655910098754 hartree
chargesum: 0.0000000
charge: -0.292776 -0.475788 -0.339313 -0.104162 0.094527 0.109539 -0.121050 -0.297746 -0.282316 -0.287779 -0.301945 0.400725 0.429571 -0.003261 -0.232474 -0.223800 -0.178422 0.222128 -0.152217 -0.158150 0.241665 -0.167815 -0.222352 -0.154955 -0.137829 -0.171447 0.091877 0.095559 0.104335 0.101928 0.100441 0.092703 0.096311 0.096612 0.093711 0.099076 0.094309 0.102257 0.097762 0.129615 0.139626 0.150227 0.163365 0.159273 0.162429 0.149844 0.162648 0.161480 0.162053
qa: -0.2928 -0.4758 -0.3393 -0.1042 0.0945 0.1095 -0.1210 -0.2977 -0.2823 -0.2878 -0.3019 0.4007 0.4296 -0.0033 -0.2325 -0.2238 -0.1784 0.2221 -0.1522 -0.1582 0.2417 -0.1678 -0.2224 -0.1550 -0.1378 -0.1714 0.0919 0.0956 0.1043 0.1019 0.1004 0.0927 0.0963 0.0966 0.0937 0.0991 0.0943 0.1023 0.0978 0.1296 0.1396 0.1502 0.1634 0.1593 0.1624 0.1498 0.1626 0.1615 0.1621
va: 2.1496 2.0242 2.0557 3.1108 3.7353 3.6896 3.9315 3.9114 3.9028 3.9086 3.9018 4.0943 3.7051 3.7588 4.0263 4.0704 3.9411 3.8042 3.9205 3.8809 3.7055 3.9096 3.9952 3.8889 3.8837 3.8848 1.0266 1.0122 0.9980 1.0003 0.9988 1.0053 1.0026 1.0017 1.0051 0.9986 1.0108 1.0002 0.9984 1.0261 1.0269 1.0007 0.9904 0.9951 0.9935 1.0053 0.9893 0.9883 0.9889
dispcorr: -0.022737655 hartree
energy: -1132.707589932430
dipole: 30.33594 -29.40350 0.93245 4.76764 -7.38585 -2.61822 -9.17654 7.49263 -1.68391
magnitude: 3.24963 au
magnitude: 8.25989 debye
