program: Orca
programVersion: 5.0.2
elementType: O O O N C C C C C C C C C C C C C C C C C C C C C C H H H H H H H H H H H H H H H H H H H H H H H
charge: 0
multiplicity: 1
keywords: wb97x-d3
keywords: def2-TZVPP
keywords: def2/J RIJCOSX
keywords: DEFGRID2
keywords: scfconv7
keywords: smallprint printgap noloewdin
keywords: NOSOSCF
formula: C22H23NO3
InChI: InChI=1/C22H23NO3/c1-21(2)19(22(21,3)4)20(24)26-18(14-23)15-9-8-12-17(13-15)25-16-10-6-5-7-11-16/h5-13,18-19H,1-4H3
49 atoms
O  0.560932 1.50137 0.036857
O  1.889471 1.749611 -1.734247
O  -3.572322 -2.585999 0.62832
N  -1.37397 2.640038 -2.514315
C  4.093575 2.015026 0.572117
C  3.763531 3.407931 0.142694
C  2.626371 2.44225 0.457433
C  4.676106 1.020009 -0.403818
C  4.584686 1.750077 1.97768
C  3.916784 4.553962 1.120289
C  4.040536 3.871291 -1.269549
C  1.717555 1.885865 -0.546931
C  -0.424437 0.909868 -0.792193
C  -1.543929 0.42198 0.094537
C  -0.93588 1.892735 -1.756625
C  -2.00401 -0.877547 -0.061398
C  -2.107266 1.26815 1.042845
C  -3.034252 -1.336076 0.752032
C  -3.133524 0.795043 1.844506
C  -3.597992 -0.504797 1.7095
C  -2.795876 -3.629861 0.179305
C  -3.31089 -4.423009 -0.834103
C  -1.568645 -3.920415 0.761265
C  -2.587134 -5.525768 -1.267805
C  -0.851329 -5.01863 0.310121
C  -1.354703 -5.823845 -0.703905
H  2.142111 2.608205 1.413413
H  4.439291 0.002586 -0.08758
H  4.333768 1.129587 -1.428439
H  5.763899 1.112193 -0.411682
H  4.11191 2.380336 2.727865
H  4.390417 0.712737 2.256027
H  5.663186 1.909595 2.0392
H  3.34401 5.416814 0.77558
H  3.570049 4.318196 2.124402
H  4.962228 4.860994 1.189578
H  4.078426 3.082551 -2.013478
H  3.289347 4.594912 -1.590357
H  5.006525 4.379601 -1.289555
H  -0.010649 0.075031 -1.365966
H  -1.560125 -1.517946 -0.81364
H  -1.755304 2.285138 1.158613
H  -3.575731 1.441854 2.590174
H  -4.396907 -0.872334 2.340647
H  -4.270075 -4.183421 -1.275072
H  -1.175594 -3.303579 1.559787
H  -2.989463 -6.147453 -2.056723
H  0.105124 -5.247964 0.761087
H  -0.791268 -6.680486 -1.048642
elementType: O N C H
totalener: -1132.68480087 hartree
nucrepener: 2183.43996832 hartree
electener: -3316.12476919 hartree
oneelecener: -5875.70209983 hartree
twoeener: 2559.57733064 hartree
cpcmener: -0.03623200 hartree
kineticenergy: 1127.64745729 hartree
xcener: -110.657656360590 hartree
chargesum: 0.0000000
charge: -0.291092 -0.478938 -0.338744 -0.106181 0.096078 0.107070 -0.116938 -0.299532 -0.281887 -0.285795 -0.304548 0.405127 0.426931 -0.010878 -0.231448 -0.157888 -0.224226 0.259587 -0.141208 -0.219322 0.269009 -0.237052 -0.187765 -0.130853 -0.146697 -0.181300 0.089547 0.101268 0.096518 0.103168 0.092782 0.096336 0.099879 0.096223 0.092876 0.099302 0.096458 0.102406 0.098916 0.131813 0.145897 0.151651 0.162154 0.150890 0.149878 0.162198 0.161973 0.163798 0.162555
qa: -0.2911 -0.4789 -0.3387 -0.1062 0.0961 0.1071 -0.1169 -0.2995 -0.2819 -0.2858 -0.3045 0.4051 0.4269 -0.0109 -0.2314 -0.1579 -0.2242 0.2596 -0.1412 -0.2193 0.2690 -0.2371 -0.1878 -0.1309 -0.1467 -0.1813 0.0895 0.1013 0.0965 0.1032 0.0928 0.0963 0.0999 0.0962 0.0929 0.0993 0.0965 0.1024 0.0989 0.1318 0.1459 0.1517 0.1622 0.1509 0.1499 0.1622 0.1620 0.1638 0.1626
va: 2.1510 2.0182 2.0665 3.1101 3.7223 3.6880 3.9344 3.9102 3.9050 3.9094 3.9065 4.0796 3.7226 3.7420 4.0202 3.9199 3.9765 3.7446 3.9280 3.9945 3.6861 4.0082 3.9217 3.8799 3.8854 3.8953 1.0286 1.0001 1.0124 0.9978 1.0050 1.0026 0.9990 1.0017 1.0055 0.9987 1.0105 0.9993 0.9984 1.0227 1.0069 1.0105 0.9888 1.0044 1.0060 0.9945 0.9881 0.9888 0.9890
dispcorr: -0.022850254 hartree
energy: -1132.707651125409
dipole: 32.52021 -31.13548 1.38473 11.48684 -12.71148 -1.22463 7.35149 -5.06448 2.28701
magnitude: 2.94068 au
magnitude: 7.47462 debye
