program: Orca
programVersion: 5.0.2
elementType: O O O N C C C C C C C C C C C C C C C C C C C C C C H H H H H H H H H H H H H H H H H H H H H H H
charge: 0
multiplicity: 1
keywords: wb97x-d3
keywords: def2-TZVPP
keywords: def2/J RIJCOSX
keywords: DEFGRID2
keywords: scfconv7
keywords: smallprint printgap noloewdin
keywords: NOSOSCF
formula: C22H23NO3
InChI: InChI=1/C22H23NO3/c1-21(2)19(22(21,3)4)20(24)26-18(14-23)15-9-8-12-17(13-15)25-16-10-6-5-7-11-16/h5-13,18-19H,1-4H3
49 atoms
O  0.175611 2.456413 0.409398
O  1.221605 0.493049 0.546909
O  -2.44608 -2.406567 -1.104036
N  -0.670637 0.678609 3.230556
C  3.801379 2.19021 -0.115435
C  3.289766 1.759627 -1.450532
C  2.321372 2.391659 -0.449024
C  4.234387 1.176776 0.918638
C  4.610672 3.462507 0.010738
C  3.578467 2.594866 -2.679195
C  3.191476 0.294859 -1.809861
C  1.240549 1.64946 0.201484
C  -1.013126 1.884481 0.935964
C  -1.756115 1.050537 -0.082457
C  -0.77686 1.181632 2.201372
C  -1.73795 -0.338749 -0.059801
C  -2.452961 1.730106 -1.074191
C  -2.433498 -1.043135 -1.034251
C  -3.130168 1.01277 -2.048638
C  -3.128534 -0.371793 -2.032967
C  -2.082255 -3.157004 -0.007779
C  -1.02058 -4.036213 -0.147525
C  -2.794468 -3.075266 1.181513
C  -0.668969 -4.850219 0.921227
C  -2.425124 -3.885275 2.245225
C  -1.3640 -4.773698 2.119911
H  2.052573 3.417407 -0.674863
H  3.728963 0.21773 0.865411
H  5.303451 0.98575 0.80527
H  4.08187 1.573998 1.923788
H  5.656893 3.274042 -0.238861
H  4.254891 4.268224 -0.627962
H  4.579502 3.825962 1.039423
H  2.864986 2.356237 -3.46991
H  3.515517 3.666409 -2.500746
H  4.577581 2.376605 -3.061958
H  3.045098 -0.37554 -0.969332
H  2.370512 0.130043 -2.509883
H  4.111683 -0.010615 -2.312078
H  -1.629787 2.749292 1.191783
H  -1.189838 -0.86659 0.709307
H  -2.473835 2.812467 -1.081665
H  -3.677115 1.535983 -2.821399
H  -3.664541 -0.933042 -2.787615
H  -0.479979 -4.088984 -1.084033
H  -3.627587 -2.389994 1.278562
H  0.155926 -5.542168 0.813332
H  -2.975109 -3.824063 3.175056
H  -1.083634 -5.405747 2.951824
elementType: O N C H
totalener: -1132.68289358 hartree
nucrepener: 2271.78434962 hartree
electener: -3404.46724320 hartree
oneelecener: -6053.85567396 hartree
twoeener: 2649.38843077 hartree
cpcmener: -0.03587467 hartree
kineticenergy: 1127.65312225 hartree
xcener: -110.661536727445 hartree
chargesum: -0.0000000
charge: -0.294724 -0.480801 -0.335134 -0.100743 0.099856 0.102621 -0.133071 -0.301943 -0.282182 -0.284598 -0.303629 0.431246 0.479359 -0.062073 -0.241918 -0.138926 -0.250413 0.267554 -0.110668 -0.247019 0.266034 -0.221985 -0.193752 -0.137594 -0.146540 -0.171918 0.086995 0.097111 0.100079 0.101872 0.099620 0.092986 0.095590 0.095518 0.093646 0.100036 0.097559 0.101878 0.100489 0.145833 0.127228 0.147907 0.161965 0.149796 0.149922 0.159830 0.161837 0.162786 0.162477
qa: -0.2947 -0.4808 -0.3351 -0.1007 0.0999 0.1026 -0.1331 -0.3019 -0.2822 -0.2846 -0.3036 0.4312 0.4794 -0.0621 -0.2419 -0.1389 -0.2504 0.2676 -0.1107 -0.2470 0.2660 -0.2220 -0.1938 -0.1376 -0.1465 -0.1719 0.0870 0.0971 0.1001 0.1019 0.0996 0.0930 0.0956 0.0955 0.0936 0.1000 0.0976 0.1019 0.1005 0.1458 0.1272 0.1479 0.1620 0.1498 0.1499 0.1598 0.1618 0.1628 0.1625
va: 2.1318 2.0175 2.0739 3.1046 3.7018 3.6959 3.9502 3.9103 3.9046 3.9058 3.9095 4.0502 3.8242 3.6973 4.0645 3.8689 4.0002 3.8044 3.8927 4.0090 3.6837 4.0034 3.9329 3.8790 3.8808 3.8883 1.0327 1.0127 0.9981 0.9990 0.9989 1.0054 1.0023 1.0023 1.0053 0.9986 1.0116 0.9990 0.9982 0.9931 1.0326 1.0031 0.9878 1.0059 1.0050 0.9956 0.9883 0.9887 0.9890
dispcorr: -0.024405082 hartree
energy: -1132.707298663109
dipole: 27.81883 -27.55137 0.26746 9.77089 -8.12016 1.65072 -9.18264 7.42182 -1.76082
magnitude: 2.42836 au
magnitude: 6.17239 debye
