program: Orca
programVersion: 5.0.2
elementType: O O O N C C C C C C C C C C C C C C C C C C C C C C H H H H H H H H H H H H H H H H H H H H H H H
charge: 0
multiplicity: 1
keywords: wb97x-d3
keywords: def2-TZVPP
keywords: def2/J RIJCOSX
keywords: DEFGRID2
keywords: scfconv7
keywords: smallprint printgap noloewdin
keywords: NOSOSCF
formula: C22H23NO3
InChI: InChI=1/C22H23NO3/c1-21(2)19(22(21,3)4)20(24)26-18(14-23)15-9-8-12-17(13-15)25-16-10-6-5-7-11-16/h5-13,18-19H,1-4H3
49 atoms
O  0.493392 2.160944 0.937227
O  1.832285 0.635392 0.019771
O  -2.296755 -2.775863 -1.061884
N  0.677585 -0.558983 2.973689
C  3.852664 3.002776 -0.405726
C  2.938994 3.140752 -1.578755
C  2.343325 2.986778 -0.175035
C  4.684868 1.757341 -0.20472
C  4.572612 4.220495 0.133066
C  2.729148 4.493037 -2.224009
C  2.802332 2.031713 -2.595076
C  1.591966 1.798978 0.230294
C  -0.408271 1.132935 1.298164
C  -1.078102 0.476786 0.106642
C  0.231141 0.17493 2.208605
C  -1.340483 -0.884615 0.089603
C  -1.486464 1.281616 -0.952245
C  -2.033206 -1.43568 -0.982192
C  -2.146833 0.709825 -2.028305
C  -2.433509 -0.646635 -2.048875
C  -2.609206 -3.481352 0.076522
C  -2.069435 -4.752765 0.201653
C  -3.474243 -2.977164 1.04003
C  -2.397655 -5.526481 1.306477
C  -3.782582 -3.756953 2.145238
C  -3.247615 -5.030986 2.285326
H  1.938036 3.903909 0.237236
H  4.269797 0.852282 -0.635558
H  5.667403 1.910308 -0.655409
H  4.842511 1.574628 0.859575
H  4.898779 4.039959 1.158838
H  5.463496 4.430021 -0.462361
H  3.959532 5.119314 0.142722
H  3.531618 4.704396 -2.933713
H  1.789588 4.501806 -2.77923
H  2.690226 5.313533 -1.510665
H  2.963835 1.031072 -2.206782
H  1.8084 2.053632 -3.04555
H  3.526018 2.189109 -3.397177
H  -1.174132 1.641279 1.890855
H  -1.011906 -1.521613 0.901592
H  -1.295625 2.346475 -0.948278
H  -2.458511 1.331562 -2.856814
H  -2.962321 -1.088362 -2.88351
H  -1.402031 -5.134582 -0.560379
H  -3.906443 -1.989832 0.9371
H  -1.976997 -6.518793 1.402579
H  -4.451819 -3.36334 2.898999
H  -3.493979 -5.633111 3.149554
elementType: O N C H
totalener: -1132.68310772 hartree
nucrepener: 2239.60824753 hartree
electener: -3372.29135525 hartree
oneelecener: -5989.08603829 hartree
twoeener: 2616.79468304 hartree
cpcmener: -0.03711607 hartree
kineticenergy: 1127.65118067 hartree
xcener: -110.662879554030 hartree
chargesum: -0.0000000
charge: -0.303928 -0.471590 -0.338754 -0.094811 0.102984 0.093521 -0.091218 -0.304053 -0.281869 -0.282644 -0.297767 0.382594 0.538774 -0.038292 -0.256691 -0.192957 -0.288208 0.287754 -0.101527 -0.247039 0.281424 -0.249892 -0.188998 -0.125322 -0.146579 -0.187874 0.087933 0.097099 0.099197 0.102403 0.095562 0.099854 0.092946 0.100593 0.095878 0.092580 0.098138 0.097758 0.103052 0.149895 0.136289 0.147714 0.162244 0.149374 0.149220 0.159102 0.161389 0.163073 0.161667
qa: -0.3039 -0.4716 -0.3388 -0.0948 0.1030 0.0935 -0.0912 -0.3041 -0.2819 -0.2826 -0.2978 0.3826 0.5388 -0.0383 -0.2567 -0.1930 -0.2882 0.2878 -0.1015 -0.2470 0.2814 -0.2499 -0.1890 -0.1253 -0.1466 -0.1879 0.0879 0.0971 0.0992 0.1024 0.0956 0.0999 0.0929 0.1006 0.0959 0.0926 0.0981 0.0978 0.1031 0.1499 0.1363 0.1477 0.1622 0.1494 0.1492 0.1591 0.1614 0.1631 0.1617
va: 2.1213 2.0261 2.0682 3.1014 3.7185 3.7153 3.9142 3.9076 3.9035 3.9030 3.9091 4.0727 3.7720 3.7242 4.1205 3.9164 3.9922 3.7516 3.8835 4.0243 3.6849 4.0048 3.9005 3.8773 3.8852 3.8983 1.0337 1.0121 0.9984 0.9989 1.0023 0.9987 1.0055 0.9988 1.0024 1.0054 1.0121 1.0010 0.9987 0.9860 1.0178 1.0111 0.9879 1.0053 1.0069 0.9955 0.9881 0.9888 0.9892
dispcorr: -0.024469549 hartree
energy: -1132.707577269636
dipole: 21.77213 -22.55096 -0.77883 20.41562 -17.96595 2.44967 -10.81125 9.81547 -0.99578
magnitude: 2.75663 au
magnitude: 7.00680 debye
