program: Orca
programVersion: 5.0.2
elementType: O O O N C C C C C C C C C C C C C C C C C C C C C C H H H H H H H H H H H H H H H H H H H H H H H
charge: 0
multiplicity: 1
keywords: wb97x-d3
keywords: def2-TZVPP
keywords: def2/J RIJCOSX
keywords: DEFGRID2
keywords: scfconv7
keywords: smallprint printgap noloewdin
keywords: NOSOSCF
formula: C22H23NO3
InChI: InChI=1/C22H23NO3/c1-21(2)19(22(21,3)4)20(24)26-18(14-23)15-9-8-12-17(13-15)25-16-10-6-5-7-11-16/h5-13,18-19H,1-4H3
49 atoms
O  0.077904 2.936009 -0.221391
O  1.23074 1.378536 0.877715
O  -2.736617 -2.165852 0.896737
N  -1.165515 2.574289 2.912852
C  3.804798 2.841602 -0.112829
C  3.414239 2.081635 -1.338254
C  2.360763 2.914762 -0.598489
C  4.172901 2.123699 1.165843
C  4.589337 4.129266 -0.244735
C  3.802973 2.596628 -2.705876
C  3.33605 0.573072 -1.328435
C  1.231807 2.302522 0.101658
C  -1.120459 2.394175 0.303111
C  -1.432226 1.013297 -0.237007
C  -1.12144 2.462768 1.769045
C  -1.889895 -0.005176 0.584301
C  -1.288209 0.794248 -1.603198
C  -2.222602 -1.236526 0.035075
C  -1.607777 -0.445825 -2.132981
C  -2.08183 -1.469255 -1.325461
C  -2.468447 -3.501204 0.711391
C  -1.18246 -3.959667 0.454825
C  -3.524964 -4.387207 0.85782
C  -0.963529 -5.324811 0.340977
C  -3.288614 -5.751019 0.75266
C  -2.010894 -6.225004 0.489658
H  2.096245 3.838033 -1.102012
H  3.74034 1.13556 1.281913
H  5.257723 2.006709 1.203261
H  3.88247 2.717069 2.034367
H  5.651183 3.916672 -0.384062
H  4.262956 4.755487 -1.072609
H  4.489178 4.721225 0.66681
H  3.75138 3.679984 -2.791484
H  4.821905 2.290157 -2.951123
H  3.141986 2.178975 -3.467381
H  4.304143 0.159032 -1.616556
H  3.06878 0.134892 -0.371828
H  2.604159 0.229735 -2.061893
H  -1.899045 3.086087 -0.030087
H  -2.001861 0.137702 1.652216
H  -0.935623 1.58055 -2.25745
H  -1.499746 -0.617101 -3.195559
H  -2.344639 -2.424976 -1.759777
H  -0.35772 -3.265919 0.350122
H  -4.520949 -4.013575 1.058743
H  0.037258 -5.684632 0.141669
H  -4.111905 -6.443074 0.871208
H  -1.830757 -7.288189 0.404372
elementType: O N C H
totalener: -1132.68298372 hartree
nucrepener: 2228.94359715 hartree
electener: -3361.62658087 hartree
oneelecener: -5967.59454911 hartree
twoeener: 2605.96796824 hartree
cpcmener: -0.03657963 hartree
kineticenergy: 1127.65544699 hartree
xcener: -110.662650197240 hartree
chargesum: 0.0000000
charge: -0.302960 -0.473210 -0.338010 -0.093793 0.109879 0.093925 -0.097940 -0.303972 -0.285845 -0.282462 -0.299937 0.387969 0.546720 -0.044524 -0.264042 -0.212540 -0.274298 0.257966 -0.124339 -0.182677 0.272628 -0.185039 -0.243597 -0.150900 -0.129455 -0.182231 0.088312 0.096389 0.098402 0.102640 0.099494 0.093354 0.095578 0.092965 0.100114 0.095608 0.104185 0.099561 0.097941 0.148691 0.121784 0.146940 0.163078 0.159095 0.162249 0.149483 0.163383 0.161548 0.161896
qa: -0.3030 -0.4732 -0.3380 -0.0938 0.1099 0.0939 -0.0979 -0.3040 -0.2858 -0.2825 -0.2999 0.3880 0.5467 -0.0445 -0.2640 -0.2125 -0.2743 0.2580 -0.1243 -0.1827 0.2726 -0.1850 -0.2436 -0.1509 -0.1295 -0.1822 0.0883 0.0964 0.0984 0.1026 0.0995 0.0934 0.0956 0.0930 0.1001 0.0956 0.1042 0.0996 0.0979 0.1487 0.1218 0.1469 0.1631 0.1591 0.1622 0.1495 0.1634 0.1615 0.1619
va: 2.1229 2.0249 2.0621 3.1046 3.7059 3.7191 3.9197 3.9057 3.9053 3.9024 3.9110 4.0683 3.7483 3.7547 4.1255 4.0214 3.9845 3.8129 3.8941 3.9126 3.6827 3.9104 4.0040 3.8890 3.8810 3.8943 1.0335 1.0117 0.9985 0.9992 0.9987 1.0054 1.0019 1.0053 0.9988 1.0025 0.9989 1.0112 1.0009 0.9876 1.0364 1.0114 0.9896 0.9955 0.9952 1.0065 0.9891 0.9881 0.9890
dispcorr: -0.024223547 hartree
energy: -1132.707207268447
dipole: 29.69957 -28.90191 0.79766 6.18688 -6.16375 0.02312 -12.73833 9.53334 -3.20499
magnitude: 3.30284 au
magnitude: 8.39515 debye
