program: Orca
programVersion: 5.0.2
elementType: O O O N C C C C C C C C C C C C C C C C C C C C C C H H H H H H H H H H H H H H H H H H H H H H H
charge: 0
multiplicity: 1
keywords: wb97x-d3
keywords: def2-TZVPP
keywords: def2/J RIJCOSX
keywords: DEFGRID2
keywords: scfconv7
keywords: smallprint printgap noloewdin
keywords: NOSOSCF
formula: C22H23NO3
InChI: InChI=1/C22H23NO3/c1-21(2)19(22(21,3)4)20(24)26-18(14-23)15-9-8-12-17(13-15)25-16-10-6-5-7-11-16/h5-13,18-19H,1-4H3
49 atoms
O  0.125252 2.80986 -0.245517
O  1.522768 1.344604 0.684404
O  -2.992207 -2.238722 0.815025
N  -0.77194 2.183804 2.97102
C  3.790895 3.320372 -0.232725
C  3.574203 2.470832 -1.440852
C  2.365738 3.098638 -0.74145
C  4.255138 2.717087 1.072958
C  4.315645 4.732426 -0.383876
C  3.873984 3.018209 -2.819282
C  3.801213 0.977626 -1.39456
C  1.366225 2.307932 -0.024819
C  -0.961088 2.140754 0.360898
C  -1.226353 0.754769 -0.196472
C  -0.818938 2.142572 1.822668
C  -1.922581 -0.173197 0.565209
C  -0.848883 0.44164 -1.496818
C  -2.24736 -1.409094 0.023576
C  -1.170044 -0.803277 -2.017972
C  -1.873784 -1.736289 -1.27277
C  -2.839692 -3.601968 0.728816
C  -1.585884 -4.199609 0.702404
C  -3.994965 -4.369616 0.738607
C  -1.499191 -5.584109 0.67817
C  -3.892334 -5.753831 0.72688
C  -2.647232 -6.366231 0.690961
H  1.939517 3.946255 -1.266028
H  5.346652 2.744055 1.1091
H  3.888994 3.309444 1.914036
H  3.951834 1.688323 1.239664
H  5.403767 4.726341 -0.474166
H  3.912232 5.256744 -1.247635
H  4.063922 5.321651 0.499705
H  4.937988 2.9213 -3.044731
H  3.325934 2.451352 -3.57413
H  3.600741 4.064425 -2.940389
H  4.827492 0.76297 -1.701281
H  3.653839 0.519882 -0.421041
H  3.139582 0.47203 -2.101056
H  -1.826233 2.773383 0.142814
H  -2.230077 0.047941 1.580514
H  -0.31274 1.150216 -2.113706
H  -0.875654 -1.048187 -3.029657
H  -2.12812 -2.69531 -1.704742
H  -0.684908 -3.599011 0.705721
H  -4.96427 -3.887892 0.762612
H  -0.52396 -6.052459 0.656846
H  -4.793473 -6.352828 0.739299
H  -2.570926 -7.44521 0.676967
elementType: O N C H
totalener: -1132.68305654 hartree
nucrepener: 2207.96184022 hartree
electener: -3340.64489676 hartree
oneelecener: -5925.56697896 hartree
twoeener: 2584.92208220 hartree
cpcmener: -0.03685326 hartree
kineticenergy: 1127.63740991 hartree
xcener: -110.660368305699 hartree
chargesum: -0.0000000
charge: -0.303718 -0.469866 -0.337032 -0.099535 0.096374 0.100003 -0.104683 -0.305434 -0.280555 -0.282790 -0.299599 0.385580 0.524103 -0.029230 -0.250546 -0.234487 -0.253887 0.265236 -0.124519 -0.190584 0.277958 -0.189602 -0.243303 -0.148010 -0.128791 -0.183697 0.088367 0.100012 0.102065 0.098797 0.099877 0.093841 0.095520 0.099818 0.095472 0.093480 0.102069 0.098092 0.099118 0.153223 0.125519 0.148820 0.162633 0.158838 0.160507 0.148890 0.162681 0.161218 0.161758
qa: -0.3037 -0.4699 -0.3370 -0.0995 0.0964 0.1000 -0.1047 -0.3054 -0.2806 -0.2828 -0.2996 0.3856 0.5241 -0.0292 -0.2505 -0.2345 -0.2539 0.2652 -0.1245 -0.1906 0.2780 -0.1896 -0.2433 -0.1480 -0.1288 -0.1837 0.0884 0.1000 0.1021 0.0988 0.0999 0.0938 0.0955 0.0998 0.0955 0.0935 0.1021 0.0981 0.0991 0.1532 0.1255 0.1488 0.1626 0.1588 0.1605 0.1489 0.1627 0.1612 0.1618
va: 2.1259 2.0248 2.0641 3.1019 3.7303 3.7023 3.9211 3.9085 3.9009 3.9034 3.9090 4.0699 3.7467 3.7726 4.1175 4.0619 3.9806 3.7921 3.9028 3.9202 3.6765 3.9113 4.0043 3.8858 3.8807 3.8939 1.0350 0.9982 0.9992 1.0124 0.9990 1.0053 1.0024 0.9988 1.0025 1.0053 0.9987 1.0112 1.0004 0.9870 1.0327 1.0107 0.9905 0.9953 0.9953 1.0068 0.9892 0.9881 0.9892
dispcorr: -0.023968879 hartree
energy: -1132.707025414078
dipole: 29.33526 -28.76920 0.56606 10.31682 -10.05778 0.25904 -12.77850 9.75983 -3.01868
magnitude: 3.08220 au
magnitude: 7.83432 debye
