program: Orca
programVersion: 5.0.2
elementType: O O O N C C C C C C C C C C C C C C C C C C C C C C H H H H H H H H H H H H H H H H H H H H H H H
charge: 0
multiplicity: 1
keywords: wb97x-d3
keywords: def2-TZVPP
keywords: def2/J RIJCOSX
keywords: DEFGRID2
keywords: scfconv7
keywords: smallprint printgap noloewdin
keywords: NOSOSCF
formula: C22H23NO3
InChI: InChI=1/C22H23NO3/c1-21(2)19(22(21,3)4)20(24)26-18(14-23)15-9-8-12-17(13-15)25-16-10-6-5-7-11-16/h5-13,18-19H,1-4H3
49 atoms
O  0.463484 1.887406 0.344639
O  0.29656 2.95543 -1.599709
O  -2.207922 -2.367693 -1.000337
N  -1.300752 1.66206 3.117557
C  3.488064 1.90808 0.017066
C  3.08178 0.685727 -0.743297
C  2.386228 2.018315 -1.036289
C  3.202406 2.046127 1.495859
C  4.775587 2.622246 -0.338609
C  3.964577 0.163221 -1.857021
C  2.351848 -0.453565 -0.067697
C  0.971479 2.332975 -0.811099
C  -0.919928 2.115327 0.571582
C  -1.80101 1.197029 -0.241541
C  -1.112903 1.861926 2.000585
C  -1.563736 -0.172989 -0.210277
C  -2.830622 1.725517 -1.003254
C  -2.384748 -1.015093 -0.945061
C  -3.638283 0.868809 -1.739343
C  -3.424277 -0.497999 -1.711354
C  -1.56617 -3.030375 0.020484
C  -0.564298 -3.921793 -0.330124
C  -1.94811 -2.870257 1.346544
C  0.06004 -4.667034 0.661286
C  -1.305097 -3.609915 2.328018
C  -0.302224 -4.510553 1.991587
H  2.712885 2.480154 -1.961586
H  4.088779 1.738348 2.054095
H  3.006721 3.088689 1.752454
H  2.372243 1.453468 1.865886
H  4.962236 2.673809 -1.409314
H  4.74966 3.64746 0.035332
H  5.629091 2.125057 0.126477
H  4.774439 -0.443622 -1.446884
H  3.385828 -0.4736 -2.52839
H  4.41057 0.949476 -2.462539
H  1.775252 -0.178204 0.809416
H  1.673594 -0.941141 -0.770653
H  3.080324 -1.202381 0.249738
H  -1.188238 3.160399 0.387224
H  -0.749422 -0.571775 0.38305
H  -3.00106 2.793934 -1.0233
H  -4.444147 1.268974 -2.339544
H  -4.055478 -1.166684 -2.282528
H  -0.281599 -4.037433 -1.36864
H  -2.738256 -2.180425 1.615391
H  0.83774 -5.3680 0.388412
H  -1.599032 -3.485332 3.361852
H  0.189896 -5.089117 2.761833
elementType: O N C H
totalener: -1132.68117827 hartree
nucrepener: 2309.83840593 hartree
electener: -3442.51958420 hartree
oneelecener: -6128.53536652 hartree
twoeener: 2686.01578232 hartree
cpcmener: -0.03461102 hartree
kineticenergy: 1127.65934957 hartree
xcener: -110.661679033754 hartree
chargesum: -0.0000000
charge: -0.272111 -0.482159 -0.335761 -0.100968 0.117437 0.123482 -0.150033 -0.288060 -0.295525 -0.287934 -0.320974 0.415052 0.384230 0.028995 -0.222558 -0.235211 -0.223006 0.296420 -0.103089 -0.251708 0.305648 -0.264386 -0.199783 -0.121816 -0.142946 -0.182426 0.087097 0.097436 0.102864 0.089977 0.093359 0.096605 0.099031 0.099508 0.096122 0.093298 0.094480 0.103197 0.104187 0.145724 0.151430 0.149414 0.162457 0.149343 0.149060 0.157732 0.161644 0.163212 0.162015
qa: -0.2721 -0.4822 -0.3358 -0.1010 0.1174 0.1235 -0.1500 -0.2881 -0.2955 -0.2879 -0.3210 0.4151 0.3842 0.0290 -0.2226 -0.2352 -0.2230 0.2964 -0.1031 -0.2517 0.3056 -0.2644 -0.1998 -0.1218 -0.1429 -0.1824 0.0871 0.0974 0.1029 0.0900 0.0934 0.0966 0.0990 0.0995 0.0961 0.0933 0.0945 0.1032 0.1042 0.1457 0.1514 0.1494 0.1625 0.1493 0.1491 0.1577 0.1616 0.1632 0.1620
va: 2.1310 2.0240 2.0798 3.1039 3.6811 3.6747 3.9214 3.9111 3.9139 3.9125 3.9162 4.1211 3.7781 3.5988 4.0732 3.9515 3.9742 3.7268 3.8850 4.0034 3.6415 4.0007 3.9139 3.8658 3.8800 3.9012 1.0292 0.9986 1.0004 1.0071 1.0055 1.0013 0.9986 0.9990 1.0015 1.0056 1.0051 0.9945 1.0007 1.0153 1.0011 1.0026 0.9876 1.0058 1.0071 0.9970 0.9878 0.9885 0.9891
dispcorr: -0.026581233 hartree
energy: -1132.707759503632
dipole: 27.76480 -26.55940 1.20540 0.23474 -0.75826 -0.52352 -1.61641 1.06774 -0.54867
magnitude: 1.42411 au
magnitude: 3.61981 debye
