program: Orca
programVersion: 5.0.2
elementType: O O O N C C C C C C C C C C C C C C C C C C C C C C H H H H H H H H H H H H H H H H H H H H H H H
charge: 0
multiplicity: 1
keywords: wb97x-d3
keywords: def2-TZVPP
keywords: def2/J RIJCOSX
keywords: DEFGRID2
keywords: scfconv7
keywords: smallprint printgap noloewdin
keywords: NOSOSCF
formula: C22H23NO3
InChI: InChI=1/C22H23NO3/c1-21(2)19(22(21,3)4)20(24)26-18(14-23)15-9-8-12-17(13-15)25-16-10-6-5-7-11-16/h5-13,18-19H,1-4H3
49 atoms
O  0.47543 1.892824 0.375711
O  0.315367 3.080066 -1.499213
O  -2.137878 -2.388041 -1.056949
N  -1.291688 1.549418 3.131865
C  3.492371 1.893279 0.083148
C  3.089407 0.772621 -0.821835
C  2.411889 2.138848 -0.967821
C  3.182975 1.859551 1.563611
C  4.794226 2.626477 -0.165621
C  3.986428 0.373166 -1.973892
C  2.334021 -0.42817 -0.297539
C  0.990344 2.420062 -0.741946
C  -0.9148 2.081372 0.600256
C  -1.763471 1.170414 -0.253247
C  -1.107819 1.782852 2.02076
C  -1.530503 -0.20052 -0.22262
C  -2.753098 1.706551 -1.061722
C  -2.31703 -1.03524 -1.002139
C  -3.525135 0.857619 -1.843668
C  -3.316077 -0.510079 -1.815219
C  -1.579525 -3.057325 0.007592
C  -2.064893 -2.901315 1.299894
C  -0.552875 -3.947481 -0.265915
C  -1.500645 -3.643815 2.326638
C  -0.008082 -4.695701 0.769279
C  -0.473908 -4.543232 2.067408
H  2.757356 2.69987 -1.829384
H  4.063499 1.496314 2.097142
H  2.975142 2.864342 1.935086
H  2.352934 1.222109 1.849896
H  5.635541 2.058044 0.235963
H  4.992504 2.817617 -1.218231
H  4.780776 3.593343 0.34084
H  4.451449 1.218977 -2.475693
H  4.782018 -0.287891 -1.623991
H  3.41257 -0.173327 -2.724468
H  1.729189 -0.245685 0.584813
H  1.677689 -0.83142 -1.071018
H  3.04891 -1.212433 -0.040607
H  -1.206251 3.125113 0.446963
H  -0.745767 -0.606414 0.404874
H  -2.921099 2.775404 -1.081427
H  -4.299261 1.264671 -2.479925
H  -3.920254 -1.173006 -2.421267
H  -2.872668 -2.210794 1.507491
H  -0.18987 -4.060359 -1.279488
H  -1.873931 -3.52157 3.33485
H  0.788274 -5.396413 0.555976
H  -0.043592 -5.123847 2.872328
elementType: O N C H
totalener: -1132.68120809 hartree
nucrepener: 2307.68470592 hartree
electener: -3440.36591401 hartree
oneelecener: -6124.23014590 hartree
twoeener: 2683.86423189 hartree
cpcmener: -0.03445085 hartree
kineticenergy: 1127.66093993 hartree
xcener: -110.661745654018 hartree
chargesum: -0.0000000
charge: -0.270166 -0.482924 -0.337087 -0.100921 0.119683 0.123751 -0.151784 -0.288398 -0.296497 -0.287713 -0.319716 0.416323 0.381762 0.037207 -0.223752 -0.241379 -0.216455 0.286318 -0.107051 -0.247896 0.303374 -0.198727 -0.264150 -0.142611 -0.121430 -0.183936 0.087251 0.097339 0.103278 0.088677 0.099690 0.092957 0.096810 0.092616 0.099378 0.096581 0.090942 0.104255 0.105264 0.145291 0.157314 0.149408 0.162459 0.149459 0.157998 0.149172 0.163532 0.162128 0.162376
qa: -0.2702 -0.4829 -0.3371 -0.1009 0.1197 0.1238 -0.1518 -0.2884 -0.2965 -0.2877 -0.3197 0.4163 0.3818 0.0372 -0.2238 -0.2414 -0.2165 0.2863 -0.1071 -0.2479 0.3034 -0.1987 -0.2641 -0.1426 -0.1214 -0.1839 0.0873 0.0973 0.1033 0.0887 0.0997 0.0930 0.0968 0.0926 0.0994 0.0966 0.0909 0.1043 0.1053 0.1453 0.1573 0.1494 0.1625 0.1495 0.1580 0.1492 0.1635 0.1621 0.1624
va: 2.1330 2.0231 2.0762 3.1044 3.6759 3.6804 3.9237 3.9116 3.9141 3.9119 3.9181 4.1236 3.7836 3.5828 4.0721 3.9484 3.9666 3.7352 3.8893 4.0068 3.6454 3.9159 4.0012 3.8797 3.8685 3.9011 1.0290 0.9986 1.0005 1.0063 0.9983 1.0057 1.0013 1.0057 0.9990 1.0016 1.0045 0.9956 1.0004 1.0153 0.9937 1.0034 0.9877 1.0054 0.9968 1.0072 0.9885 0.9876 0.9890
dispcorr: -0.026553795 hartree
energy: -1132.707761884541
dipole: 27.50352 -26.35079 1.15273 0.32541 -0.85662 -0.53121 -1.87563 1.28057 -0.59506
magnitude: 1.40181 au
magnitude: 3.56312 debye
