program: Orca
programVersion: 5.0.2
elementType: O O O N C C C C C C C C C C C C C C C C C C C C C C H H H H H H H H H H H H H H H H H H H H H H H
charge: 0
multiplicity: 1
keywords: wb97x-d3
keywords: def2-TZVPP
keywords: def2/J RIJCOSX
keywords: DEFGRID2
keywords: scfconv7
keywords: smallprint printgap noloewdin
keywords: NOSOSCF
formula: C22H23NO3
InChI: InChI=1/C22H23NO3/c1-21(2)19(22(21,3)4)20(24)26-18(14-23)15-9-8-12-17(13-15)25-16-10-6-5-7-11-16/h5-13,18-19H,1-4H3
49 atoms
O  0.57613 1.897246 0.440029
O  0.290988 3.373454 -1.20344
O  -1.984033 -2.470886 -1.127242
N  -1.064127 1.068818 3.171267
C  3.564676 2.018996 0.080409
C  3.191384 1.222589 -1.131215
C  2.465018 2.538781 -0.837359
C  3.291252 1.500446 1.475381
C  4.835459 2.844172 0.067451
C  4.085869 1.22917 -2.351569
C  2.466644 -0.098174 -1.003986
C  1.02595 2.649904 -0.571016
C  -0.818851 1.93785 0.71745
C  -1.614275 1.062063 -0.220257
C  -0.939846 1.454306 2.094737
C  -1.404313 -0.312705 -0.213946
C  -2.533141 1.633339 -1.08873
C  -2.147969 -1.114506 -1.066687
C  -3.252724 0.819073 -1.952031
C  -3.070434 -0.553594 -1.941555
C  -1.713193 -3.185424 0.015891
C  -2.37113 -2.935432 1.214102
C  -0.793267 -4.218167 -0.08868
C  -2.087419 -3.72684 2.317552
C  -0.529331 -5.009508 1.02062
C  -1.168342 -4.764314 2.228067
H  2.774448 3.351838 -1.485433
H  3.057394 2.322438 2.153728
H  2.491257 0.77118 1.549526
H  4.197052 1.021357 1.852253
H  5.70446 2.213072 0.263657
H  5.006001 3.365297 -0.872556
H  4.795756 3.600845 0.853252
H  4.532981 2.199716 -2.556228
H  4.89556 0.506353 -2.232277
H  3.517123 0.940696 -3.237374
H  1.861081 -0.205851 -0.109511
H  1.814478 -0.257126 -1.864671
H  3.196671 -0.909917 -0.997532
H  -1.198446 2.963775 0.694715
H  -0.676646 -0.75328 0.458107
H  -2.691097 2.70366 -1.088707
H  -3.96926 1.256218 -2.634108
H  -3.639574 -1.190944 -2.605889
H  -3.097481 -2.136454 1.293726
H  -0.294613 -4.404966 -1.031288
H  -2.59533 -3.530419 3.252654
H  0.184294 -5.818709 0.93723
H  -0.954955 -5.3787 3.092328
elementType: O N C H
totalener: -1132.68095074 hartree
nucrepener: 2288.22574556 hartree
electener: -3420.90669630 hartree
oneelecener: -6085.35750910 hartree
twoeener: 2664.45081280 hartree
cpcmener: -0.03395130 hartree
kineticenergy: 1127.65502361 hartree
xcener: -110.660143987319 hartree
chargesum: -0.0000000
charge: -0.266443 -0.484739 -0.339555 -0.102402 0.122400 0.103042 -0.159189 -0.286974 -0.298200 -0.286830 -0.296148 0.427065 0.394953 0.061754 -0.227700 -0.253701 -0.197389 0.255238 -0.120348 -0.233073 0.294807 -0.196361 -0.258448 -0.144881 -0.120686 -0.190076 0.088464 0.101669 0.088289 0.096585 0.099694 0.093770 0.097197 0.092334 0.099099 0.096551 0.083651 0.104936 0.105066 0.144288 0.156052 0.149552 0.162661 0.150495 0.157171 0.149399 0.163670 0.161599 0.161688
qa: -0.2664 -0.4847 -0.3396 -0.1024 0.1224 0.1030 -0.1592 -0.2870 -0.2982 -0.2868 -0.2961 0.4271 0.3950 0.0618 -0.2277 -0.2537 -0.1974 0.2552 -0.1203 -0.2331 0.2948 -0.1964 -0.2584 -0.1449 -0.1207 -0.1901 0.0885 0.1017 0.0883 0.0966 0.0997 0.0938 0.0972 0.0923 0.0991 0.0966 0.0837 0.1049 0.1051 0.1443 0.1561 0.1496 0.1627 0.1505 0.1572 0.1494 0.1637 0.1616 0.1617
va: 2.1373 2.0205 2.0694 3.1023 3.6703 3.7044 3.9220 3.9070 3.9115 3.9103 3.9220 4.1211 3.7676 3.5241 4.0706 3.9457 3.9590 3.7638 3.9036 4.0125 3.6688 3.9018 4.0088 3.8834 3.8739 3.9038 1.0289 1.0011 1.0058 0.9989 0.9986 1.0052 1.0012 1.0056 0.9990 1.0016 1.0031 0.9977 0.9997 1.0152 0.9956 1.0074 0.9880 1.0040 0.9975 1.0074 0.9887 0.9879 0.9894
dispcorr: -0.026042988 hartree
energy: -1132.706993727006
dipole: 26.96787 -26.02316 0.94470 2.37455 -2.68391 -0.30936 -3.74772 2.98141 -0.76631
magnitude: 1.25515 au
magnitude: 3.19035 debye
