program: Orca
programVersion: 5.0.2
elementType: O O O N C C C C C C C C C C C C C C C C C C C C C C H H H H H H H H H H H H H H H H H H H H H H H
charge: 0
multiplicity: 1
keywords: wb97x-d3
keywords: def2-TZVPP
keywords: def2/J RIJCOSX
keywords: DEFGRID2
keywords: scfconv7
keywords: smallprint printgap noloewdin
keywords: NOSOSCF
formula: C22H23NO3
InChI: InChI=1/C22H23NO3/c1-21(2)19(22(21,3)4)20(24)26-18(14-23)15-9-8-12-17(13-15)25-16-10-6-5-7-11-16/h5-13,18-19H,1-4H3
49 atoms
O  0.587175 1.90234 0.447476
O  0.282915 3.375553 -1.196347
O  -1.940076 -2.475539 -1.142577
N  -1.031992 1.045175 3.17587
C  3.574895 2.034436 0.070926
C  3.204263 1.276049 -1.166459
C  2.469201 2.575932 -0.825238
C  3.312316 1.462924 1.447389
C  4.838583 2.870039 0.083059
C  4.09178 1.33071 -2.390579
C  2.489655 -0.053602 -1.078623
C  1.028458 2.666515 -0.558647
C  -0.808646 1.927827 0.725085
C  -1.599603 1.053657 -0.217556
C  -0.922584 1.434358 2.099235
C  -1.379414 -0.319165 -0.221269
C  -2.526616 1.623373 -1.0790
C  -2.119716 -1.120709 -1.077118
C  -3.243154 0.809563 -1.945096
C  -3.050507 -0.562261 -1.944091
C  -1.714819 -3.190429 0.010199
C  -2.424123 -2.942016 1.179248
C  -0.786469 -4.219015 -0.054478
C  -2.185132 -3.732201 2.294126
C  -0.567685 -5.009328 1.065452
C  -1.259155 -4.766451 2.244331
H  2.771445 3.410947 -1.448384
H  2.514403 0.728801 1.499591
H  4.222398 0.972524 1.800897
H  3.079483 2.258544 2.157878
H  5.004778 3.419084 -0.841742
H  4.79247 3.603718 0.890155
H  5.71293 2.2411 0.26154
H  3.517332 1.076375 -3.283232
H  4.536174 2.309169 -2.560547
H  4.90296 0.604838 -2.305517
H  1.882912 -0.191345 -0.188641
H  1.840161 -0.193362 -1.944731
H  3.225971 -0.859852 -1.092732
H  -1.196996 2.950657 0.711471
H  -0.646158 -0.760045 0.444841
H  -2.693321 2.692487 -1.071314
H  -3.967157 1.245585 -2.620157
H  -3.618678 -1.200139 -2.608857
H  -3.157385 -2.146505 1.226635
H  -0.2445 -4.40167 -0.973874
H  -2.735665 -3.539259 3.205679
H  0.154409 -5.813858 1.013976
H  -1.081572 -5.380681 3.116813
elementType: O N C H
totalener: -1132.68087444 hartree
nucrepener: 2286.51558692 hartree
electener: -3419.19646137 hartree
oneelecener: -6081.95597493 hartree
twoeener: 2662.75951356 hartree
cpcmener: -0.03417106 hartree
kineticenergy: 1127.64418881 hartree
xcener: -110.657730826330 hartree
chargesum: 0.0000000
charge: -0.266170 -0.485146 -0.340958 -0.101973 0.123385 0.100885 -0.161753 -0.287759 -0.297587 -0.286582 -0.295060 0.429058 0.395728 0.061237 -0.228626 -0.244109 -0.194697 0.240962 -0.123181 -0.227558 0.286864 -0.189305 -0.254736 -0.147526 -0.122770 -0.188909 0.089164 0.088467 0.096710 0.101532 0.093664 0.097148 0.099474 0.096636 0.092348 0.098946 0.083845 0.104736 0.105492 0.144729 0.156893 0.149907 0.162683 0.150788 0.157164 0.149337 0.163392 0.161561 0.161671
qa: -0.2662 -0.4851 -0.3410 -0.1020 0.1234 0.1009 -0.1618 -0.2878 -0.2976 -0.2866 -0.2951 0.4291 0.3957 0.0612 -0.2286 -0.2441 -0.1947 0.2410 -0.1232 -0.2276 0.2869 -0.1893 -0.2547 -0.1475 -0.1228 -0.1889 0.0892 0.0885 0.0967 0.1015 0.0937 0.0971 0.0995 0.0966 0.0923 0.0989 0.0838 0.1047 0.1055 0.1447 0.1569 0.1499 0.1627 0.1508 0.1572 0.1493 0.1634 0.1616 0.1617
va: 2.1391 2.0196 2.0658 3.1027 3.6702 3.7103 3.9222 3.9057 3.9105 3.9098 3.9213 4.1199 3.7659 3.5206 4.0713 3.9394 3.9574 3.7714 3.9048 4.0120 3.6755 3.8956 4.0076 3.8865 3.8764 3.9016 1.0289 1.0058 0.9990 1.0012 1.0052 1.0013 0.9987 1.0015 1.0055 0.9992 1.0031 0.9980 0.9997 1.0148 0.9961 1.0072 0.9880 1.0035 0.9975 1.0073 0.9889 0.9879 0.9894
dispcorr: -0.026013528 hartree
energy: -1132.706887970903
dipole: 26.85639 -25.95226 0.90412 2.62256 -2.89083 -0.26826 -3.93290 3.16138 -0.77152
magnitude: 1.21846 au
magnitude: 3.09709 debye
