program: Orca
programVersion: 5.0.2
elementType: O O O N C C C C C C C C C C C C C C C C C C C C C C H H H H H H H H H H H H H H H H H H H H H H H
charge: 0
multiplicity: 1
keywords: wb97x-d3
keywords: def2-TZVPP
keywords: def2/J RIJCOSX
keywords: DEFGRID2
keywords: scfconv7
keywords: smallprint printgap noloewdin
keywords: NOSOSCF
formula: C22H23NO3
InChI: InChI=1/C22H23NO3/c1-21(2)19(22(21,3)4)20(24)26-18(14-23)15-9-8-12-17(13-15)25-16-10-6-5-7-11-16/h5-13,18-19H,1-4H3
49 atoms
O  0.291066 1.851067 -0.035217
O  0.980597 3.669289 1.041902
O  -2.686067 -2.369832 -0.61066
N  -1.565533 2.070784 2.79779
C  3.235296 0.898915 0.39365
C  3.086475 1.33127 -1.03073
C  2.620435 2.267855 0.079257
C  2.386411 -0.218441 0.955187
C  4.592171 0.932078 1.061416
C  4.29776 1.823052 -1.796674
C  2.128079 0.623157 -1.964746
C  1.249979 2.669529 0.413514
C  -1.060667 2.198653 0.232028
C  -1.919061 1.215364 -0.520058
C  -1.324499 2.137396 1.674891
C  -1.899037 -0.12777 -0.158935
C  -2.673287 1.651043 -1.597869
C  -2.62919 -1.038412 -0.906869
C  -3.416424 0.729103 -2.323738
C  -3.391139 -0.61342 -1.99057
C  -1.653795 -2.981574 0.062659
C  -1.992657 -3.819116 1.114033
C  -0.329581 -2.825879 -0.327902
C  -0.992119 -4.511287 1.782541
C  0.660903 -3.513905 0.357747
C  0.336508 -4.357662 1.412567
H  3.295908 3.093894 0.273995
H  1.387666 -0.293649 0.535776
H  2.884731 -1.174069 0.779249
H  2.278874 -0.10303 2.035337
H  5.200042 1.785008 0.766767
H  4.477802 0.974996 2.146004
H  5.152709 0.024636 0.827233
H  4.954116 2.46248 -1.209506
H  4.888897 0.981148 -2.162362
H  3.978271 2.401212 -2.665808
H  2.694131 -0.094996 -2.561608
H  1.329645 0.069472 -1.479832
H  1.671002 1.328098 -2.661057
H  -1.27738 3.217948 -0.100575
H  -1.31821 -0.454418 0.695879
H  -2.679932 2.698236 -1.870685
H  -4.00939 1.057789 -3.166397
H  -3.96103 -1.334021 -2.563063
H  -3.029886 -3.932603 1.402386
H  -0.0657 -2.178103 -1.154929
H  -1.256982 -5.169007 2.599777
H  1.693373 -3.389921 0.058597
H  1.114452 -4.893482 1.939598
elementType: O N C H
totalener: -1132.68243323 hartree
nucrepener: 2318.79907720 hartree
electener: -3451.48151042 hartree
oneelecener: -6145.93792290 hartree
twoeener: 2694.45641247 hartree
cpcmener: -0.03833130 hartree
kineticenergy: 1127.65501812 hartree
xcener: -110.660701667355 hartree
chargesum: 0.0000000
charge: -0.259974 -0.483258 -0.336002 -0.099851 0.114338 0.132149 -0.167354 -0.262877 -0.285272 -0.297055 -0.259107 0.426366 0.399621 0.011080 -0.223389 -0.241919 -0.201306 0.287340 -0.111665 -0.244121 0.310439 -0.251003 -0.226489 -0.123842 -0.160354 -0.179416 0.087743 0.041875 0.103177 0.103594 0.092608 0.096212 0.099314 0.092608 0.099433 0.097834 0.097437 0.054818 0.104079 0.132289 0.150657 0.149852 0.162721 0.149496 0.148549 0.174988 0.161513 0.170758 0.161366
qa: -0.2600 -0.4833 -0.3360 -0.0999 0.1143 0.1321 -0.1674 -0.2629 -0.2853 -0.2971 -0.2591 0.4264 0.3996 0.0111 -0.2234 -0.2419 -0.2013 0.2873 -0.1117 -0.2441 0.3104 -0.2510 -0.2265 -0.1238 -0.1604 -0.1794 0.0877 0.0419 0.1032 0.1036 0.0926 0.0962 0.0993 0.0926 0.0994 0.0978 0.0974 0.0548 0.1041 0.1323 0.1507 0.1499 0.1627 0.1495 0.1485 0.1750 0.1615 0.1708 0.1614
va: 2.1631 2.0163 2.0820 3.1070 3.7166 3.6622 3.9505 3.9200 3.9085 3.9144 3.9168 4.1033 3.7653 3.6839 4.0249 3.9385 3.9485 3.7504 3.8949 4.0109 3.6559 4.0191 3.8907 3.8796 3.8527 3.9042 1.0295 1.0060 0.9981 1.0055 1.0057 1.0021 0.9987 1.0057 0.9984 1.0010 1.0007 1.0031 1.0035 1.0197 1.0041 1.0004 0.9879 1.0056 1.0067 0.9857 0.9876 0.9832 0.9895
dispcorr: -0.027421138 hartree
energy: -1132.709854365291
dipole: 27.50340 -26.33770 1.16570 -3.30535 2.10621 -1.19914 -7.10703 4.61593 -2.49110
magnitude: 3.00040 au
magnitude: 7.62640 debye
